Year,Jurisdiction,Jur_Name,Parcel_ID,Account,Ownership_Sequence,Owner_Id,Owner_Prefix,Name,Careof,Street,Street_Overflow,City,State,Zip5,Zip4,Location_Code,Jur 1,Jur 2,Jur 3,Jur 4,Jur 5,Jur 6,Jur 7,Jur 8,Jur 9,Jur 10,Jur 11,Jur 12,Is_Exempt,Prop_Street_Number,Prop_Street,Prop_Street_Dir,Prop_City,Prop_State,Prop_Zip5,Prop_Zip4,Map1,Map2,Is_Protested,Has_Hs_Link,Primary_Category_Code,Secondary_Category_Code,Third_Category_Code,DBA,Interest,Ceiling_Year,Ceiling_Tax,Homestead_Code,Agent_Code,Agent_Name,Acres,Legal1,Legal2,Legal3,Legal4,Mortgage_Code,Lease_Number,Lease_Name,Operator_Name,RRC_Number,Interest_Type,Land_Hs,Land_Nhs,Land_Productivity_Market,Land_1d1,Land_1d,Land_Timber,Personal_Hs,Personal_Nhs,Market_Value,Net_Taxable_Value,State_Homestead,State_Mandated_Over65,State_Mandated_Disabled,Optional65,Local_Disabled,Road_Homestead,Disabled_Veteran,New_Personal_Hs,New_Personal_Nhs,Improvement_Hs,New_Improvement_Hs,Improvement_Nhs,New_Improvement_Nhs,Is_Owner_Confidential,Local_Discount,Has_Abatement,Has_Miscellaneous_Exemption,Abatement_Value,Mineral_Freeport_Value,Mineral_Unknown_Value
2021,CAD,CAD,500046,0084430-1-0001992,1,84430,M,ACKERMAN ASCHE TRUST B,WILMINGTON TRUST CO,1100 N MARKET ST LBBY A,,WILMINGTON,DE,19890,1100,035,CAD,CH,SK,,,,,,,,,,False,,,,,,,,,,False,False,G1,,,,0.000140,0,0.00,,,,0.0000,AB 481 SEC 271 T&NO RR CO,RRC 253386,,,,1992,HONEY W1,UNIT PETROLEUM COMPA,253386,RI,0,0,0,0,0,0,0,0,10,0,0,0,0,0,0,0,0,0,0,0,0,0,0,False,0,False,False,0,0,0
2021,CAD,CAD,500566,0005231-1-0001716,1,5231,M,WINKEL CAROL CARPENTER,ONE PETOLEUM CENTER BLD 2,3300 NORTH A STREET STE 208,,MIDLAND,TX,79705,,029,CAD,CH,SH,F5,,,,,,,,,False,,,,,,,,,,False,False,G1,,,,0.000074,0,0.00,,,,0.0000,AB 43 PETTITT W,RRC 24395,,,,1716,BLACK STONE GAS UNIT #3,S & S OPERATING CO,24395,RI,0,0,0,0,0,0,0,0,40,40,0,0,0,0,0,0,0,0,0,0,0,0,0,False,0,False,False,0,0,0
2021,CAD,CAD,500708,0005231-1-0001467,1,5231,M,WINKEL CAROL CARPENTER,ONE PETOLEUM CENTER BLD 2,3300 NORTH A STREET STE 208,,MIDLAND,TX,79705,,029,CAD,CH,SH,F5,,,,,,,,,False,,,,,,,,,,False,False,G1,,,,0.027777,0,0.00,,,,0.0000,AB 34 JACKSON STEPHEN/N 1000A,RRC 13596,,,,1467,SWAYNE J F,RADCO OPERATIONS LP,13596,RI,0,0,0,0,0,0,0,0,360,360,0,0,0,0,0,0,0,0,0,0,0,0,0,False,0,False,False,0,0,0
2021,CAD,CAD,500800,0071699-1-0001007,1,71699,M,WILSON DIANA L,,9224 S 87TH EAST AVE,,TULSA,OK,74133,5511,022,CAD,CH,SB,F4,,,,,,,,,False,,,,,,,,,,False,False,G1,,,,0.004299,0,0.00,,,,0.0000,AB 153 CHAMPION CHOATE BLK 2,RRC 215,,,,1007,CHOATE FEE LOT 8 W1-4 & 6-8,CREBBS OIL COMPANY,215,RI,0,0,0,0,0,0,0,0,530,530,0,0,0,0,0,0,0,0,0,0,0,0,0,False,0,False,False,0,0,0
2021,CAD,CAD,500925,0071699-1-0001003,1,71699,M,WILSON DIANA L,,9224 S 87TH EAST AVE,,TULSA,OK,74133,5511,022,CAD,CH,SB,F4,,,,,,,,,False,,,,,,,,,,False,False,G1,,,,0.004299,0,0.00,,,,0.0000,AB 153 CHAMPION CHOATE BLK 1,RRC 211,,,,1003,CHOATE FEE LOT 3 W1,CREBBS OIL COMPANY,211,RI,0,0,0,0,0,0,0,0,140,140,0,0,0,0,0,0,0,0,0,0,0,0,0,False,0,False,False,0,0,0
2021,CAD,CAD,501052,0084636-1-0001785,1,84636,M,WILLIAMSON EDGAR A,,4626 HIGH GATE DR,,AUSTIN,TX,78730,3439,029,CAD,CH,SH,F5,,,,,,,,,False,,,,,,,,,,False,False,G1,,,,0.000035,0,0.00,,,,0.0000,AB 33 & 43 IRVINE ROBT B & PET,RRC 187477,,,,1785,DU JAY JOYCE W#1,PLACID OPERATING LLC,187477,RI,0,0,0,0,0,0,0,0,30,0,0,0,0,0,0,0,0,0,0,0,0,0,0,False,0,False,False,0,0,0
2021,CAD,CAD,501662,0004245-1-0001959,1,4245,M,WILLIAM MARSH RICE UNIVERSITY,OIL & GAS ACCTING MS-91,PO BOX 2666,,HOUSTON,TX,77252,2666,040,CAD,CH,SK,F6,,,,,,,,,False,,,,,,,,,,False,False,G1,,,,0.127032,0,0.00,,280,HARDING & CARBONE INC,0.0000,AB 460 STUART C,RRC 224206,,,,1959,"RICE, W. M. UNIVERSITY UNIT",UNIT PETROLEUM COMPA,224206,RI,0,0,0,0,0,0,0,0,216500,216500,0,0,0,0,0,0,0,0,0,0,0,0,0,False,0,False,False,0,0,0
2021,CAD,CAD,502207,0068602-1-0001398,1,68602,M,WEINBERG RICHARD E,,PO BOX 458,,BELLAIRE,TX,77402,0458,029,CAD,CH,SH,F5,,,,,,,,,False,,,,,,,,,,False,False,G1,,,,0.000586,0,0.00,,,,0.0000,AB 34 JACKSON STEPHEN,RRC 5467     1A/C4/C7/C11/C16,,,,1398,HARDIN COUNTY OIL CO,RHEACO OIL CO LTD,5467,RI,0,0,0,0,0,0,0,0,20,20,0,0,0,0,0,0,0,0,0,0,0,0,0,False,0,False,False,0,0,0
2021,CAD,CAD,502825,0005004-1-0001001,1,5004,M,WALKER ANNA E,,560 SAN FRANCISCO AVE,,POMONA,CA,91767,4820,047,CAD,CH,SL,ML,F1,,,,,,,,False,,,,,,,,,,False,False,G1,,,,0.000005,0,0.00,,,,0.0000,AB 1 ARRIOLA EDWARDO,RRC 123,,,,1001,ARRIOLA FEE,WHITEHEAD RESOURCES,123,RI,0,0,0,0,0,0,0,0,30,0,0,0,0,0,0,0,0,0,0,0,0,0,0,False,0,False,False,0,0,0
2021,CAD,CAD,502850,0005010-1-0001028,1,5010,M,WALKER LINDSEY,BAD ADDRESS/RETURNED MAIL,,,,,,,MIN039,CAD,CH,SK,SS,F2,F6,,,,,,,False,,,,,,,,,,False,False,G1,,,,0.000234,0,0.00,,880,BAD ADDRESS/RETURNED MAIL,0.0000,AB 6 BINNS HENRY,RRC 1860,,,,1028,S HAMPTON UNIT W4,SHOCO PRODUCTION LLC,1860,RI,0,0,0,0,0,0,0,0,100,0,0,0,0,0,0,0,0,0,0,0,0,0,0,False,0,False,False,0,0,0
2021,CAD,CAD,503053,0076030-0-9900070,1,76030,M,SPRINT DBA T-MOBILE,PROPERTY TAX DEPARTMENT,PO BOX 85022,,BELLEVUE,WA,98015,8522,047,CAD,CH,SL,ML,F1,,,,,,,,False,,,,,,,,,,False,False,L2Q,,,,0.000000,0,0.00,,,,0.0000,150 EAST CHANCE ST,,,,,9900070,CELLULAR EQMT,ACCT:19280000080,,RA,0,0,0,0,0,0,0,0,24830,24830,0,0,0,0,0,0,0,0,0,0,0,0,0,False,0,False,False,0,0,0
2021,CAD,CAD,503057,0004990-1-0001363,1,4990,M,VINTON JEAN R MIN TR,SANDRA V KANTROWITZ,2250 WASHINGTON ST,,HOLLISTON,MA,01746,1429,029,CAD,CH,SH,F5,,,,,,,,,False,,,,,,,,,,False,False,G1,,,,0.001042,0,0.00,,,,0.0000,AB 34 JACKSON STEPHEN,RRC 3866,,,,1363,TARVER-HARDIN,RADCO OPERATIONS LP,3866,RI,0,0,0,0,0,0,0,0,2730,2730,0,0,0,0,0,0,0,0,0,0,0,0,0,False,0,False,False,0,0,0
2021,CAD,CAD,503098,0004948-1-0001427,1,4948,M,UDEL JOAN ERBE,GARY WASE,16 PALMER GREEN CT,,BALTIMORE,MD,21210,1502,029,CAD,CH,SH,F5,,,,,,,,,False,,,,,,,,,,False,False,G1,,,,0.022884,0,0.00,,,,0.0000,AB 34 JACKSON STEPHEN,RRC 9120,,,,1427,COHEN AARON EST,RADCO OPERATIONS LP,9120,RI,0,0,0,0,0,0,0,0,800,800,0,0,0,0,0,0,0,0,0,0,0,0,0,False,0,False,False,0,0,0
2021,CAD,CAD,503149,0083887-4-0001959,1,83887,M,UNIT PETROLEUM CO,KE ANDREWS,1900 DALROCK RD,,ROWLETT,TX,75088,5526,040,CAD,CH,SK,F6,,,,,,,,,False,,,,,,,,,,False,False,G1,,,,0.722477,0,0.00,,040,KE ANDREWS & COMPANY,0.0000,AB 460 STUART C,RRC 224206,,,,1959,"RICE, W. M. UNIVERSITY UNIT",UNIT PETROLEUM COMPA,224206,WI,0,0,0,0,0,0,0,0,704230,704230,0,0,0,0,0,0,0,0,0,0,0,0,0,False,0,False,False,0,0,0
2021,CAD,CAD,503231,0006368-0-9900040,1,6368,M,SPECTRUM GULF COAST LLC,PROPERTY TAX DEPARTMENT,PO BOX 7467,,CHARLOTTE,NC,28241,7467,061,CAD,CH,TI,SS,F2,,,,,,,,False,,,,,,,,,,False,False,J7,,,,0.000000,0,0.00,,,,0.0000,,205 E AVE. J - SILSBEE,,,,9900040,FF&E & VEHICLES,ACCT:0192000040,,RA,0,0,0,0,0,0,0,0,17060,17060,0,0,0,0,0,0,0,0,0,0,0,0,0,False,0,False,False,0,0,0
2021,CAD,CAD,503248,0006322-1-0001506,1,6322,M,TURNER WILLIAM HARDEE JR,,PO BOX 2001,,GALVESTON,TX,77553,2001,022,CAD,CH,SB,F4,,,,,,,,,False,,,,,,,,,,False,False,G1,,,,0.001191,0,0.00,,,,0.0000,AB 153 CHAMPION CHOATE,RRC 18428,,,,1506,CHOATE BLK 1 LOT 2,CREBBS OIL COMPANY,18428,RI,0,0,0,0,0,0,0,0,10,10,0,0,0,0,0,0,0,0,0,0,0,0,0,False,0,False,False,0,0,0
2021,CAD,CAD,503250,0004941-1-0001028,1,4941,M,TYTEX PROPERTIES LTD,BAD ADDRESS/RETURNED MAIL,,,,,,,MIN039,CAD,CH,SK,SS,F2,F6,,,,,,,False,,,,,,,,,,False,False,G1,,,,0.000255,0,0.00,,880,BAD ADDRESS/RETURNED MAIL,0.0000,AB 6 BINNS HENRY,RRC 1860,,,,1028,S HAMPTON UNIT W4,SHOCO PRODUCTION LLC,1860,RI,0,0,0,0,0,0,0,0,110,110,0,0,0,0,0,0,0,0,0,0,0,0,0,False,0,False,False,0,0,0
2021,CAD,CAD,503293,0090394-1-0002000,1,90394,M,TURNER GWEN,,804 SE CENTRAL PKWY APT 14,,STUART,FL,34994,3940,019,CAD,CH,SB,,,,,,,,,,False,,,,,,,,,,False,False,G1,,,,0.000035,0,0.00,,,,0.0000,AB 66 ALLEN J,RRC 260041,,,,2000,BP -L- W#1,UNIT PETROLEUM COMPA,260041,RI,0,0,0,0,0,0,0,0,380,0,0,0,0,0,0,0,0,0,0,0,0,0,0,False,0,False,False,0,0,0
2021,CAD,CAD,503566,0006441-0-9900130,1,6441,M,TRUNKLINE GAS CO,PROPERTY TAX DEPARTMENT,800 E SONTERRA BLVD STE 400,,SAN ANTONIO,TX,78258,3941,021,CAD,CH,SB,F3,,,,,,,,,False,,,,,,,,,,False,False,J6,,,,0.000000,0,0.00,,040,KE ANDREWS & COMPANY,0.0000,,,,,,9900130,"8.14 MI 24"" 1951 PIPELINE",ACCT:0955000960,,RA,0,0,0,0,0,0,0,0,765010,765010,0,0,0,0,0,0,0,0,0,0,0,0,0,False,0,False,False,0,0,0
2021,CAD,CAD,503578,0076568-1-0001974,1,76568,M,TUBB GEORGE T,,42 SHARPESTONE CV,,JACKSON,TN,38305,5713,053,CAD,CH,SS,F2,,,,,,,,,False,,,,,,,,,,False,False,G1,,,,0.000239,0,0.00,,,,0.0000,AB 21 CHAS A FELDER,RRC 235789,,,,1974,"RILEY, PAT ET AL",SOUTHERN OIL OF LOUI,235789,RI,0,0,0,0,0,0,0,0,10,0,0,0,0,0,0,0,0,0,0,0,0,0,0,False,0,False,False,0,0,0
2021,CAD,CAD,503751,0004829-1-0001741,1,4829,M,THOMAS ERSYL,BAD ADDRESS/RETURNED MAIL,,,,,,,047,CAD,CH,SL,ML,F1,,,,,,,,False,,,,,,,,,,False,False,G1,,,,0.000080,0,0.00,,880,BAD ADDRESS/RETURNED MAIL,0.0000,AB 1 ARRIOLA EDWARDO,RRC 25062,,,,1741,BP COUNTRY LANE,ZACHRY EXPLORATION,25062,RI,0,0,0,0,0,0,0,0,410,410,0,0,0,0,0,0,0,0,0,0,0,0,0,False,0,False,False,0,0,0
2021,CAD,CAD,503809,0068484-1-0001665,1,68484,M,TERRELL JOHN B,,1643 PRAIRIE GROVE DR,,HOUSTON,TX,77077,3170,029,CAD,CH,SH,F5,,,,,,,,,False,,,,,,,,,,False,False,G1,,,,0.000229,0,0.00,,,,0.0000,AB 49 STEPHENSON HENRY,RRC 19968,,,,1665,WILKINSON ETAL,FOUNDATION ENERGY MA,19968,RI,0,0,0,0,0,0,0,0,170,0,0,0,0,0,0,0,0,0,0,0,0,0,0,False,0,False,False,0,0,0
2021,CAD,CAD,503824,0072976-1-0001673,1,72976,M,TEJAS ROYALTY INC,,PO BOX 27605,,HOUSTON,TX,77227,7605,MIN069,CAD,CH,SH,TS,F5,,,,,,,,False,,,,,,,,,,False,False,G1,,,,0.003125,0,0.00,,,,0.0000,AB 49 STEPHENSON HENRY,RRC 20271,,,,1673,CARPENTER UNIT 1&2,FOUNDATION ENERGY MA,20271,RI,0,0,0,0,0,0,0,0,2030,2030,0,0,0,0,0,0,0,0,0,0,0,0,0,False,0,False,False,0,0,0
2021,CAD,CAD,504053,0005808-1-0001699,1,5808,M,TANTON JON ETHEL,,PO BOX 40,,SILSBEE,TX,77656,0040,053,CAD,CH,SS,F2,,,,,,,,,False,,,,,,,,,,False,False,G1,,,,0.012500,0,0.00,,,,0.0000,AB 13 & 45 COX W N & RAFFERTY,RRC 25590 23382,,,,1699,TANTON,WALLIS ENERGY INC,25590,RI,0,0,0,0,0,0,0,0,20,0,0,0,0,0,0,0,0,0,0,0,0,0,0,False,0,False,False,0,0,0
2021,CAD,CAD,504121,0008429-1-0001499,1,8429,M,TALBOT DWAYNE MAURICE JR,,16677 WAR CLOUD DR,,MORENO VALLEY,CA,92551,2512,047,CAD,CH,SL,ML,F1,,,,,,,,False,,,,,,,,,,False,False,G1,,,,0.000586,0,0.00,,,,0.0000,AB 1 ARRIOLA EDWARDO,RRC 17563,,,,1499,KIRBY LUMBER -A,WHITEHEAD RESOURCES,17563,RI,0,0,0,0,0,0,0,0,10,0,0,0,0,0,0,0,0,0,0,0,0,0,0,False,0,False,False,0,0,0
2021,CAD,CAD,504245,0006967-1-0001017,1,6967,M,SWALM JO BETH,VALERI WHITE,4006 FM 1035,,WELLINGTON,TX,79095,4420,022,CAD,CH,SB,F4,,,,,,,,,False,,,,,,,,,,False,False,G1,,,,0.002884,0,0.00,,,,0.0000,AB 621 KNIGHT JOHN,RRC 236,,,,1017,STATELAND 365/387/390,BATSON ENT VENTURES,236,RI,0,0,0,0,0,0,0,0,230,230,0,0,0,0,0,0,0,0,0,0,0,0,0,False,0,False,False,0,0,0
2021,CAD,CAD,504246,0072341-0-9900090,1,72341,M,T-MOBILE WEST LLC,PROPERTY TAX DEPARTMENT,12920 SE 38TH ST,,BELLEVUE,WA,98006,1350,029,CAD,CH,SH,F5,,,,,,,,,False,,,,,,,,,,False,False,L2Q,,,,0.000000,0,0.00,,,,0.0000,SITE #:A3H0053,31100 OLD SOUR LK RD,,,,9900090,CELL EQUIPMENT,ACCT:18940000110,,RA,0,0,0,0,0,0,0,0,64690,64690,0,0,0,0,0,0,0,0,0,0,0,0,0,False,0,False,False,0,0,0
2021,CAD,CAD,504260,0090320-1-0001373,1,90320,M,SWINGLE EUGENIA S,,2511 MADRONE AVE,,STOCKTON,CA,95207,1320,MIN069,CAD,CH,SH,TS,F5,,,,,,,,False,,,,,,,,,,False,False,G1,,,,0.000614,0,0.00,,,,0.0000,AB 34 JACKSON STEPHEN,RRC 3887,,,,1373,YOUNT ETAL SPLIT -A,RADCO OPERATIONS LP,3887,RI,0,0,0,0,0,0,0,0,10,0,0,0,0,0,0,0,0,0,0,0,0,0,0,False,0,False,False,0,0,0
2021,CAD,CAD,504283,0072341-0-9900130,1,72341,M,T-MOBILE WEST LLC,PROPERTY TAX DEPARTMENT,12920 SE 38TH ST,,BELLEVUE,WA,98006,1350,053,CAD,CH,SS,F2,,,,,,,,,False,,,,,,,,,,False,False,L2Q,,,,0.000000,0,0.00,,,,0.0000,SITE #:A3H0080,4196 DOHMAN RD - SILSBEE,,,,9900130,CELL EQUIPMENT,ACCT:18940000150,,RA,0,0,0,0,0,0,0,0,79340,79340,0,0,0,0,0,0,0,0,0,0,0,0,0,False,0,False,False,0,0,0
2021,CAD,CAD,504286,0072054-0-9900080,1,72054,M,SUNOCO PIPELINE LP,PROPERTY TAX DEPARTMENT,1735 MARKET ST STE LL,,PHILADELPHIA,PA,19103,7501,075,CAD,CH,TS,SH,F5,,,,,,,,False,,,,,,,,,,False,False,L2P,,,,0.000000,0,0.00,,040,KE ANDREWS & COMPANY,0.0000,FCC #1046023  299FT  1957,HWY 105 E OF SOUR LAKE,,,,9900080,MICROWAVE TOWER,ACCT:0755000310,,RA,0,0,0,0,0,0,0,0,35880,35880,0,0,0,0,0,0,0,0,0,0,0,0,0,False,0,False,False,0,0,0
2021,CAD,CAD,504327,0072341-0-9900050,1,72341,M,T-MOBILE WEST LLC,PROPERTY TAX DEPARTMENT,12920 SE 38TH ST,,BELLEVUE,WA,98006,1350,040,CAD,CH,SK,F6,,,,,,,,,False,,,,,,,,,,False,False,L2Q,,,,0.000000,0,0.00,,,,0.0000,SITE #:A3I0005,4894 POST OAK RD - KOUNTZE,,,,9900050,CELL EQUIPMENT,ACCT:18940000050,,RA,0,0,0,0,0,0,0,0,17340,17340,0,0,0,0,0,0,0,0,0,0,0,0,0,False,0,False,False,0,0,0
2021,CAD,CAD,504353,0006433-0-9900200,1,6433,M,SUNOCO PIPELINE LP,PROPERTY TAX DEPARTMENT,1735 MARKET ST STE LL,,PHILADELPHIA,PA,19103,7528,021,CAD,CH,SB,F3,,,,,,,,,False,,,,,,,,,,False,False,J6,,,,0.000000,0,0.00,,040,KE ANDREWS & COMPANY,0.0000,,,,,,9900200,"3.49 MI 4"" 1957 PIPELINE",ACCT:0755000230,,RA,0,0,0,0,0,0,0,0,53460,53460,0,0,0,0,0,0,0,0,0,0,0,0,0,False,0,False,False,0,0,0
2021,CAD,CAD,504746,0083773-2-0001482,1,83773,M,SOUTHWEST PETROLEUM CO,,PO BOX 702377,,DALLAS,TX,75370,2377,021,CAD,CH,SB,F3,,,,,,,,,False,,,,,,,,,,False,False,G1,,,,0.008000,0,0.00,,,,0.0000,AB 435 REAVES J B,RRC 15926,,,,1482,COOPER-TRADD -B,VANYA OIL & GAS,15926,OR,0,0,0,0,0,0,0,0,3590,3590,0,0,0,0,0,0,0,0,0,0,0,0,0,False,0,False,False,0,0,0
2021,CAD,CAD,504763,0084404-1-0001003,1,84404,M,SPB PROPERTIES LTD,,PO BOX 2538,,LUFKIN,TX,75902,2538,022,CAD,CH,SB,F4,,,,,,,,,False,,,,,,,,,,False,False,G1,,,,0.001776,0,0.00,,,,0.0000,AB 153 CHAMPION CHOATE BLK 1,RRC 211,,,,1003,CHOATE FEE LOT 3 W1,CREBBS OIL COMPANY,211,RI,0,0,0,0,0,0,0,0,60,60,0,0,0,0,0,0,0,0,0,0,0,0,0,False,0,False,False,0,0,0
2021,CAD,CAD,504767,0007425-1-0001024,1,7425,M,SPINDLETOP EXPLORATION CO,,PO BOX 25163,,DALLAS,TX,75225,1163,022,CAD,CH,SB,F4,,,,,,,,,False,,,,,,,,,,False,False,G1,,,,0.000684,0,0.00,,,,0.0000,AB 24 F H GREEN,RRC 252,,,,1024,WING W D ETAL,PORTER JAMES W SPEC,252,RI,0,0,0,0,0,0,0,0,4320,4320,0,0,0,0,0,0,0,0,0,0,0,0,0,False,0,False,False,0,0,0
2021,CAD,CAD,504771,0006430-0-9900130,1,6430,M,SOUTHWESTERN BELL TELEPHONE LP,PROPERTY TAX DEPARTMENT,1010 PINE 9E-L-01,,SAINT LOUIS,MO,63101,,025,CAD,CH,SH,,,,,,,,,,False,,,,,,,,,,False,False,J4,,,,0.000000,0,0.00,,,,0.0000,,HARDIN-JEFFERSON ISD,,,,9900130,TELEPHONE LINES & APPURT,ACCT:0725000130,,RA,0,0,0,0,0,0,0,0,29190,29190,0,0,0,0,0,0,0,0,0,0,0,0,0,False,0,False,False,0,0,0
2021,CAD,CAD,504819,0004639-1-0001746,1,4639,M,SOFFORD DICK KEITH,RICHARD SOFFORD,18879 E KENT PL,,AURORA,CO,80013,3639,029,CAD,CH,SH,F5,,,,,,,,,False,,,,,,,,,,False,False,G1,,,,0.000185,0,0.00,,,,0.0000,AB 784 KEITH J F,RRC 25144,,,,1746,CLUBB WEST 1,WAGNER OIL COMPANY,25144,RI,0,0,0,0,0,0,0,0,20,20,0,0,0,0,0,0,0,0,0,0,0,0,0,False,0,False,False,0,0,0
2021,CAD,CAD,504857,0006429-0-9900070,1,6429,M,SOUTH HAMPTON RESOURCE INC,PROPERTY TAX DEPARTMENT,PO BOX 1636,,SILSBEE,TX,77656,1636,053,CAD,CH,SS,F2,,,,,,,,,False,,,,,,,,,,False,False,F2,,,,0.000000,0,0.00,,,,0.0000,POLLUTION CTRL @ 100% EXEMPT,TCEQ # 04/8527-8538 & 8540-854,,,,9900070,,ACCT:0720000050,,RA,0,0,0,0,0,0,0,0,296960,0,0,0,0,0,0,0,0,0,0,0,0,0,0,False,0,False,False,0,0,0
2021,CAD,CAD,504858,0006430-0-9900110,1,6430,M,SOUTHWESTERN BELL TELEPHONE LP,PROPERTY TAX DEPARTMENT,1010 PINE 9E-L-01,,SAINT LOUIS,MO,63101,,073,CAD,CH,TR,SL,ML,F1,,,,,,,False,,,,,,,,,,False,False,J4,,,,0.000000,0,0.00,,,,0.0000,,CITY OF ROSEHILL ACRES,,,,9900110,TELEPHONE LINES & APPURT,ACCT:0725000110,,RA,0,0,0,0,0,0,0,0,33700,33700,0,0,0,0,0,0,0,0,0,0,0,0,0,False,0,False,False,0,0,0
2021,CAD,CAD,504979,0008331-1-0001667,1,8331,M,SMITH F V III,,3423 ETON AVE,,FORT SMITH,AR,72908,8717,MIN069,CAD,CH,SH,TS,F5,,,,,,,,False,,,,,,,,,,False,False,G1,,,,0.000268,0,0.00,,,,0.0000,AB 49 STEPHENSON HENRY,RRC 20040,,,,1667,SUN PIPE LINE COMPANY FEE 2-4,FOUNDATION ENERGY MA,20040,RI,0,0,0,0,0,0,0,0,20,0,0,0,0,0,0,0,0,0,0,0,0,0,0,False,0,False,False,0,0,0
2021,CAD,CAD,505053,0004612-1-0001489,1,4612,M,SMITH JOE E,,4104 CAT HOLLOW DR,,AUSTIN,TX,78731,2002,022,CAD,CH,SB,F4,,,,,,,,,False,,,,,,,,,,False,False,G1,,,,0.000689,0,0.00,,,,0.0000,AB 621 KNIGHT JOHN,RRC 16590,,,,1489,DISHMAN H E 1-4,SETAB PROD,16590,RI,0,0,0,0,0,0,0,0,10,0,0,0,0,0,0,0,0,0,0,0,0,0,0,False,0,False,False,0,0,0
2021,CAD,CAD,505147,0007619-1-0001672,1,7619,M,SMITH FLORENCE,,UNTRACEABLE ADDRESS,,,,,,MIN069,CAD,CH,SH,TS,F5,,,,,,,,False,,,,,,,,,,False,False,G1,,,,0.000220,0,0.00,,,,0.0000,AB 92 & 93 BERRYMAN WILLIAM,RRC 20138,,,,1672,CHEVRON FEE 2&3,FOUNDATION ENERGY MA,20138,RI,0,0,0,0,0,0,0,0,20,0,0,0,0,0,0,0,0,0,0,0,0,0,0,False,0,False,False,0,0,0
2021,CAD,CAD,505151,0084182-1-0001373,1,84182,M,SMELKER NELSON T,,GREENBRIAR TRAIL,,MT DORA,FL,32757,,MIN069,CAD,CH,SH,TS,F5,,,,,,,,False,,,,,,,,,,False,False,G1,,,,0.000989,0,0.00,,,,0.0000,AB 34 JACKSON STEPHEN,RRC 3887,,,,1373,YOUNT ETAL SPLIT -A,RADCO OPERATIONS LP,3887,RI,0,0,0,0,0,0,0,0,10,10,0,0,0,0,0,0,0,0,0,0,0,0,0,False,0,False,False,0,0,0
2021,CAD,CAD,505183,0084046-1-0001027,1,84046,M,SLOVER RONALD,,3614 ROYAL RD,,AMARILLO,TX,79109,4338,022,CAD,CH,SB,F4,,,,,,,,,False,,,,,,,,,,False,False,G1,,,,0.010417,0,0.00,,,,0.0000,AB 24 F H GREEN,RRC 257,,,,1027,PARAFFINE 12 ACRES,SARATOGA OIL COMPANY,257,RI,0,0,0,0,0,0,0,0,10,10,0,0,0,0,0,0,0,0,0,0,0,0,0,False,0,False,False,0,0,0
2021,CAD,CAD,505204,0082286-1-0001785,1,82286,M,SIPES STEPHEN DOUGLASS,,1426 FOREST HOME DR,,HOUSTON,TX,77077,1430,029,CAD,CH,SH,F5,,,,,,,,,False,,,,,,,,,,False,False,G1,,,,0.000088,0,0.00,,,,0.0000,AB 33 & 43 IRVINE ROBT B & PET,RRC 187477,,,,1785,DU JAY JOYCE W#1,PLACID OPERATING LLC,187477,RI,0,0,0,0,0,0,0,0,80,0,0,0,0,0,0,0,0,0,0,0,0,0,0,False,0,False,False,0,0,0
2021,CAD,CAD,505259,0004567-1-0001006,1,4567,M,SINGLETON OLGA PATRICIA,,2647 6TH ST APT 15,,SANTA MONICA,CA,90405,4429,022,CAD,CH,SB,F4,,,,,,,,,False,,,,,,,,,,False,False,G1,,,,0.004298,0,0.00,,,,0.0000,AB 153 CHAMPION CHOATE BLK 2,RRC 214,,,,1006,"CHOATE FEE LOT 6 W1,3,5,6",CREBBS OIL COMPANY,214,RI,0,0,0,0,0,0,0,0,530,530,0,0,0,0,0,0,0,0,0,0,0,0,0,False,0,False,False,0,0,0
2021,CAD,CAD,505265,0084046-1-0001026,1,84046,M,SLOVER RONALD,,3614 ROYAL RD,,AMARILLO,TX,79109,4338,022,CAD,CH,SB,F4,,,,,,,,,False,,,,,,,,,,False,False,G1,,,,0.010417,0,0.00,,,,0.0000,AB 621 KNIGHT JOHN,RRC 256,,,,1026,PARAFFINE-KNIGHT,SARATOGA OIL COMPANY,256,RI,0,0,0,0,0,0,0,0,10,10,0,0,0,0,0,0,0,0,0,0,0,0,0,False,0,False,False,0,0,0
2021,CAD,CAD,505316,0004567-1-0001708,1,4567,M,SINGLETON OLGA PATRICIA,,2647 6TH ST APT 15,,SANTA MONICA,CA,90405,4429,059,CAD,CH,SW,F8,,,,,,,,,False,,,,,,,,,,False,False,G1,,,,0.007655,0,0.00,,,,0.0000,AB 74 BROWN GEORGE HEIRS OF S,RRC 23855,,,,1708,FLETCHER NONA MIN (809) W28,FOUNDATION ENERGY MA,23855,RI,0,0,0,0,0,0,0,0,30,30,0,0,0,0,0,0,0,0,0,0,0,0,0,False,0,False,False,0,0,0
2021,CAD,CAD,505424,0082316-1-0001785,1,82316,M,SIMPSON-OMOHUNDRO FOUNDATION,,PO BOX 7343,,BEAUMONT,TX,77726,7343,029,CAD,CH,SH,F5,,,,,,,,,False,,,,,,,,,,False,False,G1,,,,0.002786,0,0.00,,,,0.0000,AB 33 & 43 IRVINE ROBT B & PET,RRC 187477,,,,1785,DU JAY JOYCE W#1,PLACID OPERATING LLC,187477,RI,0,0,0,0,0,0,0,0,2440,2440,0,0,0,0,0,0,0,0,0,0,0,0,0,False,0,False,False,0,0,0
2021,CAD,CAD,505577,0076971-1-0001026,1,76971,M,SHIDLER MARK OR MITZI,,1313 CAMPBELL RD STE D,,HOUSTON,TX,77055,6429,022,CAD,CH,SB,F4,,,,,,,,,False,,,,,,,,,,False,False,G1,,,,0.020833,0,0.00,,,,0.0000,AB 621 KNIGHT JOHN,RRC 256,,,,1026,PARAFFINE-KNIGHT,SARATOGA OIL COMPANY,256,RI,0,0,0,0,0,0,0,0,20,20,0,0,0,0,0,0,0,0,0,0,0,0,0,False,0,False,False,0,0,0
2021,CAD,CAD,505660,0090346-1-0001725,1,90346,M,SHIRLEY STOREY,,6295 PITTMAN RD,,ADKINS,TX,78101,2558,047,CAD,CH,SL,ML,F1,,,,,,,,False,,,,,,,,,,False,False,G1,,,,0.000030,0,0.00,,,,0.0000,AB 1 ARRIOLA EDWARDO,RRC 24728,,,,1725,ARRIOLA #1,TEXIAN OPERATING CO,24728,RI,0,0,0,0,0,0,0,0,10,0,0,0,0,0,0,0,0,0,0,0,0,0,0,False,0,False,False,0,0,0
2021,CAD,CAD,505675,0084567-2-0001974,1,84567,M,SETTLE HOWARD A,,1537 BULL LEA RD STE 200,,LEXINGTON,KY,40511,1200,053,CAD,CH,SS,F2,,,,,,,,,False,,,,,,,,,,False,False,G1,,,,0.001052,0,0.00,,,,0.0000,AB 21 CHAS A FELDER,RRC 235789,,,,1974,"RILEY, PAT ET AL",SOUTHERN OIL OF LOUI,235789,OR,0,0,0,0,0,0,0,0,20,0,0,0,0,0,0,0,0,0,0,0,0,0,0,False,0,False,False,0,0,0
2021,CAD,CAD,505773,0007342-1-0001007,1,7342,M,SCHEPENS PATRICIA VEAL,,4312 YORK ST,,WICHITA FALLS,TX,76309,4017,022,CAD,CH,SB,F4,,,,,,,,,False,,,,,,,,,,False,False,G1,,,,0.000204,0,0.00,,,,0.0000,AB 153 CHAMPION CHOATE BLK 2,RRC 215,,,,1007,CHOATE FEE LOT 8 W1-4 & 6-8,CREBBS OIL COMPANY,215,RI,0,0,0,0,0,0,0,0,30,0,0,0,0,0,0,0,0,0,0,0,0,0,0,False,0,False,False,0,0,0
2021,CAD,CAD,505800,0007342-1-0001005,1,7342,M,SCHEPENS PATRICIA VEAL,,4312 YORK ST,,WICHITA FALLS,TX,76309,4017,022,CAD,CH,SB,F4,,,,,,,,,False,,,,,,,,,,False,False,G1,,,,0.000204,0,0.00,,,,0.0000,AB 153 CHAMPION CHOATE BLK 2,RRC 213,,,,1005,"CHOATE FEE LOT 5 W1,2,4,5",CREBBS OIL COMPANY,213,RI,0,0,0,0,0,0,0,0,10,0,0,0,0,0,0,0,0,0,0,0,0,0,0,False,0,False,False,0,0,0
2021,CAD,CAD,505914,0080226-2-0001753,1,80226,M,SANTA ROSA RESOURCES INC,,3405 EDLOE ST STE 240,,HOUSTON,TX,77027,,029,CAD,CH,SH,F5,,,,,,,,,False,,,,,,,,,,False,False,G1,,,,0.007500,0,0.00,,,,0.0000,AB 249 HAMILTON ISAAC D,RRC 25376,,,,1753,ISAAC W1,COBRA OIL & GAS CORP,25376,OR,0,0,0,0,0,0,0,0,1820,1820,0,0,0,0,0,0,0,0,0,0,0,0,0,False,0,False,False,0,0,0
2021,CAD,CAD,506041,0001368-1-0001691,1,1368,M,RUSSELL RUTH BOWMAN,PAT LANGE,PO BOX 12199,,SAN ANTONIO,TX,78212,0199,022,CAD,CH,SB,F4,,,,,,,,,False,,,,,,,,,,False,False,G1,,,,0.019792,0,0.00,,,,0.0000,AB 16 DONOHOE WILLIS,RRC 22087,,,,1691,MCLEAN MARRS -B,U D MAN INC,22087,RI,0,0,0,0,0,0,0,0,1450,1450,0,0,0,0,0,0,0,0,0,0,0,0,0,False,0,False,False,0,0,0
2021,CAD,CAD,506076,0004409-1-0001968,1,4409,M,RYAN MARGARET ANN MCCONNICO,,333 RIVERCREST DR,,FORT WORTH,TX,76107,1638,040,CAD,CH,SK,F6,,,,,,,,,False,,,,,,,,,,False,False,G1,,,,0.008038,0,0.00,,,,0.0000,AB 375 LANDIS J,RRC 229905,,,,1968,"PETTY ""A"" W#7",UNION GAS OPERATING,229905,RI,0,0,0,0,0,0,0,0,1700,1700,0,0,0,0,0,0,0,0,0,0,0,0,0,False,0,False,False,0,0,0
2021,CAD,CAD,506535,0069795-1-0001428,1,69795,M,ROLLINS THOMAS W,,1101 LANGLEY LN,,MCLEAN,VA,22101,,053,CAD,CH,SS,F2,,,,,,,,,False,,,,,,,,,,False,False,G1,,,,0.012500,0,0.00,,,,0.0000,AB 30 HAMPTON A,RRC 9275,,,,1428,HAMPTON A R & S FEE,PREMIUM EXPLORATION,9275,RI,0,0,0,0,0,0,0,0,60,0,0,0,0,0,0,0,0,0,0,0,0,0,0,False,0,False,False,0,0,0
2021,CAD,CAD,507361,0002663-1-0001496,1,2663,M,REH FAMILY LTD,,3781 WILLOWICK RD,,HOUSTON,TX,77019,1115,021,CAD,CH,SB,F3,,,,,,,,,False,,,,,,,,,,False,False,G1,,,,0.025000,0,0.00,,,,0.0000,AB 783 JORDIT C F S,RRC 17113,,,,1496,HYNSON GEORGE G JR,SARATOGA PROD COMP,17113,RI,0,0,0,0,0,0,0,0,70,70,0,0,0,0,0,0,0,0,0,0,0,0,0,False,0,False,False,0,0,0
2021,CAD,CAD,507546,0081886-1-0001028,1,81886,M,RANCHO OIL COMPANY LLC,,PO BOX 919,,GAINESVILLE,TX,76241,0919,MIN039,CAD,CH,SK,SS,F2,F6,,,,,,,False,,,,,,,,,,False,False,G1,,,,0.000084,0,0.00,,161,INVOKE TAX PARTNERS,0.0000,AB 6 BINNS HENRY,RRC 1860,,,,1028,S HAMPTON UNIT W4,SHOCO PRODUCTION LLC,1860,RI,0,0,0,0,0,0,0,0,40,0,0,0,0,0,0,0,0,0,0,0,0,0,0,False,0,False,False,0,0,0
2021,CAD,CAD,507594,0075404-1-0001740,1,75404,M,Q4 INTERESTS LTD,,13501 RANCH ROAD 12 STE 103,,WIMBERLEY,TX,78676,,029,CAD,CH,SH,F5,,,,,,,,,False,,,,,,,,,,False,False,G1,,,,0.046875,0,0.00,,,,0.0000,AB 784 KEITH J F,RRC 25032,,,,1740,PICA,WAGNER OIL COMPANY,25032,RI,0,0,0,0,0,0,0,0,41040,41040,0,0,0,0,0,0,0,0,0,0,0,0,0,False,0,False,False,0,0,0
2021,CAD,CAD,507695,0005534-4-0001729,1,5534,M,RADCO OPERATIONS LP,,PO BOX 1017,,SOUR LAKE,TX,77659,1017,029,CAD,CH,SH,F5,,,,,,,,,False,,,,,,,,,,False,False,G1,,,,0.803028,0,0.00,,015,A A V T C,0.0000,AB 34 JACKSON STEPHEN,RRC 24816,,,,1729,MCNAMARA,RADCO OPERATIONS LP,24816,WI,0,0,0,0,0,0,0,0,2610,2610,0,0,0,0,0,0,0,0,0,0,0,0,0,False,0,False,False,0,0,0