Year,Jurisdiction,Jur_Name,Parcel_ID,Account,Ownership_Sequence,Owner_Id,Owner_Prefix,Name,Careof,Street,Street_Overflow,City,State,Zip5,Zip4,Location_Code,Jur 1,Jur 2,Jur 3,Jur 4,Jur 5,Jur 6,Jur 7,Jur 8,Jur 9,Jur 10,Jur 11,Jur 12,Is_Exempt,Prop_Street_Number,Prop_Street,Prop_Street_Dir,Prop_City,Prop_State,Prop_Zip5,Prop_Zip4,Map1,Map2,Is_Protested,Has_Hs_Link,Primary_Category_Code,Secondary_Category_Code,Third_Category_Code,DBA,Interest,Ceiling_Year,Ceiling_Tax,Homestead_Code,Agent_Code,Agent_Name,Acres,Legal1,Legal2,Legal3,Legal4,Mortgage_Code,Lease_Number,Lease_Name,Operator_Name,RRC_Number,Interest_Type,Land_Hs,Land_Nhs,Land_Productivity_Market,Land_1d1,Land_1d,Land_Timber,Personal_Hs,Personal_Nhs,Market_Value,Net_Taxable_Value,State_Homestead,State_Mandated_Over65,State_Mandated_Disabled,Optional65,Local_Disabled,Road_Homestead,Disabled_Veteran,New_Personal_Hs,New_Personal_Nhs,Improvement_Hs,New_Improvement_Hs,Improvement_Nhs,New_Improvement_Nhs,Is_Owner_Confidential,Local_Discount,Has_Abatement,Has_Miscellaneous_Exemption,Abatement_Value,Mineral_Freeport_Value,Mineral_Unknown_Value
2021,CAD,CAD,10,000001-000160,1,100550,R,*** CONFIDENTIAL OWNER ***,,,,,,,,047,CAD,CH,SL,ML,F1,,,,,,,,False,,,,,,,,,,False,False,J4,,,,1.000000,0,0.00,,,,5.1130,* CONFIDENTIAL OWNER *,,,,,,,,,,45760,0,0,0,0,0,0,0,45760,45760,0,0,0,0,0,0,0,0,0,0,0,0,0,True,0,False,False,0,0,0
2021,CAD,CAD,16,000002-000150,1,114137,R,VAN DYKE JOHN,,150 DOGWOOD LN,,LUMBERTON,TX,77657,,070,CAD,CH,TL,SL,ML,F1,,,,,,,False,150,DOGWOOD LN,,LUMBERTON,TX,77657,,,,False,False,A1,,,,1.000000,0,0.00,,,,0.5600,AB 2 F ARRIOLA,,P# 2-3-B   TRACT 17C,I# 2020-101487  1/28/2020,,,,,,,23520,0,0,0,0,0,0,0,209370,209370,0,0,0,0,0,0,0,0,0,185850,0,0,0,False,0,False,False,0,0,0
2021,CAD,CAD,18,000002-000161,1,115044,R,HALEY SHAWN LYNN & REBECCA R,,120 DOGWOOD LN,,LUMBERTON,TX,77657,7185,070,CAD,CH,TL,SL,ML,F1,,,,,,,False,120,DOGWOOD LN,,LUMBERTON,TX,77657,,29D15,,False,False,D1,E1,,,1.000000,0,0.00,,,,6.5320,LOT 2 OF THE M & M JAMES ADDN,AB 2 F ARRIOLA,P# 2-3-C-1,I# 2020-106185   07/30/2020,,,,,,,20000,0,110640,830,0,0,0,0,141340,31530,0,0,0,0,0,0,0,0,0,10700,0,0,0,False,0,False,False,0,0,0
2021,CAD,CAD,27,000002-002255,1,40278,R,SET CUSTOM HOMES INC,DAVID GRACEDEL,PO BOX 8605,,LUMBERTON,TX,77657,0605,070,CAD,CH,TL,SL,ML,F1,,,,,,,False,,DOGWOOD,,LUMBERTON,TX,77657,,,,False,False,C1,,,,1.000000,0,0.00,,,,1.6170,AB 2 F ARRIOLA,,P# 2-9,,,,,,,,11320,0,0,0,0,0,0,0,11320,11320,0,0,0,0,0,0,0,0,0,0,0,0,0,False,0,False,False,0,0,0
2021,CAD,CAD,42,000002-002346,1,46687,R,*** CONFIDENTIAL OWNER ***,,,,,,,,070,CAD,CH,TL,SL,ML,F1,,,,,,,False,,,,,,,,,,False,False,A1,,,,1.000000,0,0.00,H,,,2.4100,* CONFIDENTIAL OWNER *,,,,,,,,,,42180,0,0,0,0,0,0,0,214740,192810,0,0,0,0,0,0,0,0,0,172560,0,0,0,True,0,False,False,0,0,0
2021,CAD,CAD,81,000002-002460,1,44392,R,TED LUMBERTON DEVELOPMENT LTD,THOMAS CORMIER-GENERAL MANAGER,PO BOX 8702,,LUMBERTON,TX,77657,0702,047,CAD,CH,SL,ML,F1,,,,,,,,False,,,,LUMBERTON,TX,77657,,,,False,False,E,,,,1.000000,0,0.00,,28,WILSON & FRANCO,5.6310,AB 2 F ARRIOLA,DRAINAGE TRACT,P# 2-10-Q-2,I# 1221/674,,,,,,,0,5040,0,0,0,0,0,0,5040,5040,0,0,0,0,0,0,0,0,0,0,0,0,0,False,0,False,False,0,0,0
2021,CAD,CAD,95,000002-002531,1,78027,R,GREEN ROBERT M,,6605 CARNATION,,LUMBERTON,TX,77657,7209,070,CAD,CH,TL,SL,ML,F1,,,,,,,False,6605,CARNATION DR,,LUMBERTON,TX,77657,,,,False,False,M1,,,,1.000000,0,0.00,H,,,0.0000,LOT 1 BLK 1 SUMMERVILLE MHP   LAND PID# 00094,2000  16X76  GRAY/GREEN  RAD1289269,P# 2-10-S        HCAD# 14524,,,,,,,,0,0,0,0,0,0,0,0,29150,25040,0,0,0,0,0,0,0,0,0,29150,0,0,0,False,0,False,False,0,0,0
2021,CAD,CAD,110,000002-002546,1,102454,R,MONCADA SALOMON,,6650 PRIMROSE,,LUMBERTON,TX,77657,,070,CAD,CH,TL,SL,ML,F1,,,,,,,False,6650,PRIMROSE,,LUMBERTON,TX,77657,,,,False,False,M1,,,,1.000000,0,0.00,,,,0.0000,2001  32X68  BEIGE/DK GRAY  PFS0722137/8,LAND PID# 00094,P# 2-10-S        HCAD# 21017,I# SOL   02/13/2015,,,,,,,0,0,0,0,0,0,0,0,46840,46840,0,0,0,0,0,0,0,0,0,46840,0,0,0,False,0,False,False,0,0,0
2021,CAD,CAD,125,000002-002701,1,70054,R,SEALES JAMES,,175 REDBUD LN,,LUMBERTON,TX,77657,7184,070,CAD,CH,TL,SL,ML,F1,,,,,,,False,175,REDBUD LN,,LUMBERTON,TX,77657,,,,True,False,A1,,,,1.000000,0,0.00,H,,,4.3600,AB 2 F ARRIOLA,,P# 2-17-A,,,,,,,,95400,0,0,0,0,0,0,0,262370,0,0,0,0,0,0,0,0,0,0,145020,21950,0,0,False,0,False,False,0,0,0
2021,CAD,CAD,152,000002-003900,1,44365,R,TAYLOR WAYNE E,,85 BLANTON RD,,LUMBERTON,TX,77657,7101,070,CAD,CH,TL,SL,ML,F1,,,,,,,False,85,BLANTON RD,S,LUMBERTON,TX,77657,,,,False,False,A1,,,,1.000000,0,0.00,H,,,1.0000,AB 2 F ARRIOLA,,P# 2-31   TRACT 24,,,,,,,,42000,0,0,0,0,0,0,0,145710,124110,0,0,0,0,0,0,0,0,0,103710,0,0,0,False,0,False,False,0,0,0
2021,CAD,CAD,160,000002-004210,1,50556,R,WORRY LUTHER DALE,,420 JORDAN DR,,LUMBERTON,TX,77657,7186,070,CAD,CH,TL,SL,ML,F1,,,,,,,False,420,JORDAN DR,,LUMBERTON,TX,77657,,,,False,False,A1,,,,1.000000,0,0.00,H,,,0.6560,AB 2 F ARRIOLA,,P# 2-36-1,I# 835/428,,,,,,,16400,0,0,0,0,0,0,0,218400,166020,0,0,0,0,0,0,0,0,0,193830,8170,0,0,False,0,False,False,0,0,0
2021,CAD,CAD,167,000002-004500,1,117544,R,LANDRY PATRICIA,,85 JORDAN DR,,LUMBERTON,TX,77657,6936,070,CAD,CH,TL,SL,ML,F1,,,,,,,False,85,JORDAN DR,,LUMBERTON,TX,77657,,,,False,False,A1,,,,1.000000,0,0.00,H,,,0.6200,AB 2 F ARRIOLA,,P# 2-41   TRACT 63 A,,,,,,,,26040,0,0,0,0,0,0,0,112940,102170,0,0,0,0,0,0,0,0,0,86900,0,0,0,False,0,False,False,0,0,0
2021,CAD,CAD,227,000002-006830,1,79589,R,PIAZZA STEPHEN ROY &,JILL RUTHAN SHEFFIELD-PIAZZA,495 JORDAN DR,,LUMBERTON,TX,77657,7187,070,CAD,CH,TL,SL,ML,F1,,,,,,,False,495,JORDAN DR,,LUMBERTON,TX,77657,,,,False,False,A1,,,,1.000000,0,0.00,H,,,0.9270,AB 2 F ARRIOLA,,P# 2-75-B,I# 2015-57217   07/21/2015,,,,,,,35040,0,0,0,0,0,0,0,113890,88850,0,0,0,0,0,0,0,0,0,73820,5030,0,0,False,0,False,False,0,0,0
2021,CAD,CAD,257,000002-007455,1,49302,R,HEBERT BEVERLY BOZEMAN,,2395 HEBERT RD,,BEAUMONT,TX,77705,,047,CAD,CH,SL,ML,F1,,,,,,,,False,7622,HICKORY HOLLOW DR,,LUMBERTON,TX,77657,,,,False,False,A4,,,,1.000000,0,0.00,,,,0.0000,HOUSE ONLY,LAND PID# 256,P# 2-83-D,,,,,,,,0,0,0,0,0,0,0,0,98560,98560,0,0,0,0,0,0,0,0,0,98560,0,0,0,False,0,False,False,0,0,0
2021,CAD,CAD,266,000002-007650,1,105800,R,BLACKMON WALTER,,7453 HICKORY HOLLOW DR,,LUMBERTON,TX,77657,9780,047,CAD,CH,SL,ML,F1,,,,,,,,False,7453,HICKORY HOLLOW DR,,LUMBERTON,TX,77657,,,,False,False,A1,,,,1.000000,0,0.00,H,,,1.0000,AB 2 F ARRIOLA,,P# 2-85-A   TRACT 83A,I# 2017-73019   03/23/2017,,,,,,,7500,0,0,0,0,0,0,0,72840,72840,0,0,0,0,0,0,0,0,0,63510,1830,0,0,False,0,False,False,0,0,0
2021,CAD,CAD,270,000002-007725,1,41728,R,SMITH ELAINE MARIE,,300 SPILLERS RD,,LUMBERTON,TX,77657,7648,047,CAD,CH,SL,ML,F1,,,,,,,,False,300,SPILLERS RD,,LUMBERTON,TX,77657,,,,False,True,A2,,,,1.000000,0,0.00,H,,,1.6600,AB 2 F ARRIOLA,,P# 2-86-C,I# 1163/707   10/16/1998,,,,,,,12450,0,0,0,0,0,0,0,16570,13700,0,0,0,0,0,0,0,0,0,4120,0,0,0,False,0,False,False,0,0,0
2021,CAD,CAD,275,000002-007950,1,113734,R,CERRANTES SANTIAGO,,4635 SPILLERS RD,,LUMBERTON,TX,77657,,047,CAD,CH,SL,ML,F1,,,,,,,,False,4635,SPILLERS RD,,LUMBERTON,TX,77657,,,,False,False,A2,,,,1.000000,0,0.00,,,,1.5150,AB 2 F ARRIOLA,M/H PID 82481,P# 2-88-E   TRACT 3,I# 2019-100821   12/30/2020,,,,,,,11360,0,0,0,0,0,0,0,11360,11360,0,0,0,0,0,0,0,0,0,0,0,0,0,False,0,False,False,0,0,0
2021,CAD,CAD,350,000002-009345,1,19355,R,GRIMES WANDA,,1756 BRIARCLIFF DR,,BEAUMONT,TX,77706,2918,047,CAD,CH,SL,ML,F1,,,,,,,,False,4002,SHEFFIELD LN,,LUMBERTON,TX,77657,,,,False,False,C1,,,,1.000000,0,0.00,,,,1.0190,PT OF LOT 204-D,AB 2 F ARRIOLA,P# 2-110-BB-367-B,I# 1237/102 & 1247/256,,,,,,,14720,0,0,0,0,0,0,0,14720,14720,0,0,0,0,0,0,0,0,0,0,0,0,0,False,0,False,False,0,0,0
2021,CAD,CAD,366,000002-009365,1,102749,R,SIMMONS TIMMY & TERRY L,,1652 SPELL LN,,LUMBERTON,TX,77657,,047,CAD,CH,SL,ML,F1,,,,,,,,False,1652,SPELL LN,,LUMBERTON,TX,77657,,29C,,False,True,A2,,,,1.000000,0,0.00,H,,,2.0000,LOT 237 ARRIOLA ACRES,M/H PID 80579,P# 2-110-BB-172,I# 2016-61370   01/04/2016,,,,,,,38000,0,0,0,0,0,0,0,63420,63420,0,0,0,0,0,0,0,0,0,7320,18100,0,0,False,0,False,False,0,0,0
2021,CAD,CAD,382,000002-009383,1,94750,R,KNODEN JOHN & NAN,,6635 N FAWN,,LUMBERTON,TX,77657,,047,CAD,CH,SL,ML,F1,,,,,,,,False,4156,SHEFFIELD LN,,LUMBERTON,TX,77657,,,,False,False,C1,,,,1.000000,0,0.00,,,,1.1600,LOT 204B ARRIOLA ACRES,AB 2 F ARRIOLA,P# 2-110-BB-342 MH PID 82144,I# 2014-45414   03/19/2014,,,,,,,27840,0,0,0,0,0,0,0,33960,33960,0,0,0,0,0,0,0,0,0,6120,0,0,0,False,0,False,False,0,0,0
2021,CAD,CAD,385,000002-009386,1,108681,R,DAO PHUONG,,6720 N FAWN DR,,LUMBERTON,TX,77657,6744,047,CAD,CH,SL,ML,F1,,,,,,,,False,6720,FAWN DR,S,LUMBERTON,TX,77657,,,,False,False,A1,,,,1.000000,0,0.00,H,,,3.5240,PART OF LOT 203 ARRIOLA ACRES,AB 2 F ARRIOLA,P# 2-110-BB-354,I# 2018-84259   04/17/2018,,,,,,,66960,0,0,0,0,0,0,0,235140,215970,0,0,0,0,0,0,0,0,0,168180,0,0,0,False,0,False,False,0,0,0
2021,CAD,CAD,394,000002-009399,1,85909,R,MCCARTY ROSE J,,4810 ARIOLA LN,,LUMBERTON,TX,77657,9715,047,CAD,CH,SL,ML,F1,,,,,,,,False,4810,ARIOLA LN,,LUMBERTON,TX,77657,,,,False,True,A2,,,,1.000000,0,0.00,H,,,0.0000,2009  30X48  BEIGE/WHITE  PFS1067831/2,LAND PID# 363,P# 2-110-BB-14   HCAD# 16398,,,,,,,,0,0,0,0,0,0,0,0,69790,59640,0,0,0,0,0,0,0,0,0,69790,0,0,0,False,0,False,False,0,0,0
2021,CAD,CAD,472,000002-010810,1,30380,R,MCCAIN THELMA ROBERTA,,5081 ARIOLA LN,,LUMBERTON,TX,77657,9720,047,CAD,CH,SL,ML,F1,,,,,,,,False,,ARIOLA LN,,LUMBERTON,TX,77657,,,,False,False,C1,,,,1.000000,0,0.00,,,,0.4600,LOT 36 ARRIOLA ACRES,AB 2 F ARRIOLA,P# 2-110-MM-1,I# 1186/186,,,,,,,5520,0,0,0,0,0,0,0,5520,5520,0,0,0,0,0,0,0,0,0,0,0,0,0,False,0,False,False,0,0,0
2021,CAD,CAD,473,000002-010855,1,81893,R,BOYETT R LANETTE,,6199 JOHNSON LN,,LUMBERTON,TX,77657,9788,047,CAD,CH,SL,ML,F1,,,,,,,,False,6199,JOHNSON LN,,LUMBERTON,TX,77657,,,,False,False,A1,,,,1.000000,0,0.00,H,,,1.6600,LOT 332 ARRIOLA ACRES   AB 2 F ARRIOLA,MOBILE HOME PID# 476,P# 2-110-RR,I# 1632/154   07/19/2007,,,,,,,39840,0,0,0,0,0,0,0,109510,98240,0,0,0,0,0,0,0,0,0,69670,0,0,0,False,0,False,False,0,0,0
2021,CAD,CAD,528,000002-011405,1,99035,R,THIBODEAUX WAYNE J JR & KATHERINE E,,4990 ARIOLA LANE,,LUMBERTON,TX,77657,,047,CAD,CH,SL,ML,F1,,,,,,,,False,4560,GRACE,,LUMBERTON,TX,77657,,,,False,False,C1,,,,1.000000,0,0.00,,,,4.2400,LOT 119 ARRIOLA ACRES   AB 2 F ARRIOLA,,P# 2-110-QQQ-1,I# 2014-48303    07/14/2014,,,,,,,0,50880,0,0,0,0,0,0,50880,50880,0,0,0,0,0,0,0,0,0,0,0,0,0,False,0,False,False,0,0,0
2021,CAD,CAD,532,000002-011415,1,35476,R,PELT DAWN N,,6382 JOHNSON LN,,LUMBERTON,TX,77657,6722,047,CAD,CH,SL,ML,F1,,,,,,,,False,6382,JOHNSON LN,,LUMBERTON,TX,77657,,,,False,False,M1,,,,1.000000,0,0.00,,,,0.0000,1999  14X76  GRAY/WHITE  RAD1083524,LAND PID# 516,P# 2-110-HHH       HCAD# 7326,,,,,,,,0,0,0,0,0,0,0,0,39320,39320,0,0,0,0,0,0,0,0,0,39320,0,0,0,False,0,False,False,0,0,0
2021,CAD,CAD,562,000002-011617,1,95171,R,ROBINSON JOHNNY WAYNE,,6875 JOHNSON LN,,LUMBERTON,TX,77657,,047,CAD,CH,SL,ML,F1,,,,,,,,False,6851,JOHNSON LN,,LUMBERTON,TX,77657,,,,False,False,C1,,,,1.000000,0,0.00,,,,1.7000,PART OF LOT 323C ARRIOLA ACRES,AB 2 F ARRIOLA   MOBILE HOME PID# 71903,P# 2-133-A,I# 2011-23191   09/26/2012,,,,,,,32300,0,0,0,0,0,0,0,32300,32300,0,0,0,0,0,0,0,0,0,0,0,0,0,False,0,False,False,0,0,0
2021,CAD,CAD,714,000003-002150,1,30018,R,MASON MICHAEL E,,9105 BUSSEY RD,,SILSBEE,TX,77656,8346,053,CAD,CH,SS,F2,,,,,,,,,False,9105,BUSSEY RD,,SILSBEE,TX,77656,,,,False,False,A1,,,,1.000000,0,0.00,H,,,0.8100,AB 3 S P BANKSTON,,P# 3-35-A-1,I# 856/62,,,,,,,11930,0,0,0,0,0,0,0,51330,42660,0,0,0,0,0,0,0,0,0,39400,0,0,0,False,0,False,False,0,0,0
2021,CAD,CAD,830,000003-006250,1,87636,R,BLUE JOSHUA M,,8594 WILLIS RD,,SILSBEE,TX,77656,8470,053,CAD,CH,SS,F2,,,,,,,,,False,8594,WILLIS RD,,SILSBEE,TX,77656,,,,False,False,A1,,,,1.000000,0,0.00,,,,4.1200,AB 3 S P BANKSTON,,P# 3-95,I# 1756/783   12/11/2009,,,,,,,60690,0,0,0,0,0,0,0,170100,170100,0,0,0,0,0,0,0,0,0,109410,0,0,0,False,0,False,False,0,0,0
2021,CAD,CAD,833,000003-006350,1,84909,R,BYLSMA MARIE COLLINS,,308 HILL TERRACE DR,,NEDERLAND,TX,77627,,053,CAD,CH,SS,F2,,,,,,,,,False,8670,WILLIS RD,,SILSBEE,TX,77656,,,,False,False,A1,,,,1.000000,0,0.00,H,,,0.6600,AB 3 S P BANKSTON,,P# 3-97,I# 1702/432   10/22/2008,,,,,,,9720,0,0,0,0,0,0,0,72990,60790,0,0,0,0,0,0,0,0,0,63270,0,0,0,False,0,False,False,0,0,0
2021,CAD,CAD,843,000003-006750,1,33100,R,MOSS EMMA J,,8896 WILLIS RD,,SILSBEE,TX,77656,9642,053,CAD,CH,SS,F2,,,,,,,,,False,8896,WILLIS RD,,SILSBEE,TX,77656,,,,False,False,A1,,,,1.000000,0,0.00,H,,,1.0000,AB 3 S P BANKSTON,,P# 3-105   TRACT 88,I# 2014-51759   12/04/2014,,,,,,,14730,0,0,0,0,0,0,0,55400,45410,0,0,0,0,0,0,0,0,0,40670,0,0,0,False,0,False,False,0,0,0
2021,CAD,CAD,880,000003-007921,1,112132,R,MCKEE TODD J & AMANDA S,,8434 COLE RD,,SILSBEE,TX,77656,,053,CAD,CH,SS,F2,,,,,,,,,False,,COLE LN,,SILSBEE,TX,77656,,,,False,False,C1,,,,1.000000,0,0.00,,,,0.2970,AB 3 S P BANKSTON,M/H PID# 49548,P# 3-130-A,I# 2019-100221   12/05/2019,,,,,,,0,2660,0,0,0,0,0,0,2660,2660,0,0,0,0,0,0,0,0,0,0,0,0,0,False,0,False,False,0,0,0
2021,CAD,CAD,913,000003-009000,1,24595,R,JOHNSON BARRY,,10104 BUSSEY RD,,SILSBEE,TX,77656,8198,053,CAD,CH,SS,F2,,,,,,,,,False,10104,BUSSEY RD,,SILSBEE,TX,77656,,,,False,False,A1,,,,1.000000,0,0.00,H,,,5.0000,AB 3 S P BANKSTON,,P# 3-146   TRACT 126,,,,,,,,44750,0,0,0,0,0,0,0,174940,149300,0,0,0,0,0,0,0,0,0,130190,0,0,0,False,0,False,False,0,0,0
2021,CAD,CAD,924,000003-009405,1,112107,R,HALL CHRISTOPHER LEE & CASEY ELAINE,,10 IDLEWILD,,LUMBERTON,TX,77657,,053,CAD,CH,SS,F2,,,,,,,,,False,2915,FM 92,,SILSBEE,TX,77656,,,,False,False,A2,,,,1.000000,0,0.00,,,,1.8120,AB 3 S P BANKSTON,2019  26X72  GREY  NTA1890987/8 HCAD#19411,P# 3-150-A-1,I# 2019-95289   06/03/2019,,,,,,,26690,0,0,0,0,0,0,0,99390,99390,0,0,0,0,0,0,0,0,0,72700,0,0,0,False,0,False,False,0,0,0
2021,CAD,CAD,961,000003-010350,1,29652,R,MARICLE DWAYNE,,7538 MARICLE LN,,SILSBEE,TX,77656,7376,053,CAD,CH,SS,F2,,,,,,,,,False,7538,MARICLE LN,,SILSBEE,TX,77656,,,,True,False,A1,,,,1.000000,0,0.00,H,,,3.0000,AB 3 S P BANKSTON,,P# 3-161,I# 1044/165 & 1151/739,,,,,,,26510,0,0,0,0,0,0,0,92080,0,0,0,0,0,0,0,0,0,0,65570,0,0,0,False,0,False,False,0,0,0
2021,CAD,CAD,987,000003-011550,1,5083,R,BOHLER ALMA W,,9029 WILLIAMSON DR,,SILSBEE,TX,77656,9130,053,CAD,CH,SS,F2,,,,,,,,,False,9029,WILLIAMSON DR,,SILSBEE,TX,77656,,,,False,False,A1,,,,1.000000,0,0.00,H,,,1.2500,AB 3 S P BANKSTON,,P# 3-179-C,,,,,,,,18410,0,0,0,0,0,0,0,106660,88420,0,0,0,0,0,0,0,0,0,88250,0,0,0,False,0,False,False,0,0,0
2021,CAD,CAD,1015,000003-012534,1,27646,R,LEE BRENDA K,,9163 BRITTONVILLE RD,,SILSBEE,TX,77656,8183,053,CAD,CH,SS,F2,,,,,,,,,False,,,,SILSBEE,TX,77656,,,,False,False,C1,,,,1.000000,0,0.00,,,,0.2500,AB 3 S P BANKSTON,,P# 3-193-G-7,I# 1006/241,,,,,,,3680,0,0,0,0,0,0,0,3680,3680,0,0,0,0,0,0,0,0,0,0,0,0,0,False,0,False,False,0,0,0
2021,CAD,CAD,1027,000003-012900,1,108452,R,RIEHLE CHRISTOPHER TIMOTHY & ARIEL,,2753 NEYLAND RD,,SILSBEE,TX,77656,,053,CAD,CH,SS,F2,,,,,,,,,False,2753,NEYLAND RD,,SILSBEE,TX,77656,,,,False,False,A1,,,,1.000000,0,0.00,,,,0.5000,AB 3 S P BANKSTON,PINEVIEW TERRACE,P# 3-193-G-18   TRACT 16,I# 2018-81924   01/24/2018,,,,,,,7370,0,0,0,0,0,0,0,99030,99030,0,0,0,0,0,0,0,0,0,91660,0,0,0,False,0,False,False,0,0,0
2021,CAD,CAD,1028,000003-012950,1,101412,R,AGNEW JACOB D,,2374  BUCHANAN RD,,SILSBEE,TX,77656,,053,CAD,CH,SS,F2,,,,,,,,,False,2374,BUCHANNON RD,,SILSBEE,TX,77656,,,,True,False,A1,,,,1.000000,0,0.00,H,,,0.7200,AB 3 S P BANKSTON,PINEVIEW TERRACE,P# 9-193-G-19      TRACT 18,I# 2015-56778   07/07/2015,,,,,,,10610,0,0,0,0,0,0,0,141500,0,0,0,0,0,0,0,0,0,0,130890,0,0,0,False,0,False,False,0,0,0
2021,CAD,CAD,1070,000003-014500,1,20256,R,HANKINS OLIVE C,,370 STRINGTOWN RD,,WILLIAMSBURG,KY,40769,9727,053,CAD,CH,SS,F2,,,,,,,,,False,7678,FM 1122,,SILSBEE,TX,77656,,,,False,False,A1,,,,1.000000,0,0.00,H,,,0.5400,AB 3 S P BANKSTON,,P# 3-203,I# 1658/117 & 1346/706,,,,,,,7950,0,0,0,0,0,0,0,58060,41360,0,0,0,0,0,0,0,0,0,50110,0,0,0,False,0,False,False,0,0,0
2021,CAD,CAD,1112,000003-016150,1,105866,R,JOHNSON LLOYD L,LIFE ESTATE,8366 FM 1122,,SILSBEE,TX,77656,,053,CAD,CH,SS,F2,,,,,,,,,False,8366,FM 1122,,SILSBEE,TX,77656,,,,False,False,A1,,,,1.000000,0,0.00,H,,,0.3100,LOT 1 CARROLL S/D,AB 3 S P BANKSTON,P# 3-213,I# 2017-73235   03/31/2017,,,,,,,4570,0,0,0,0,0,0,0,46600,38790,0,0,0,0,0,0,0,0,0,42030,0,0,0,False,0,False,False,0,0,0
2021,CAD,CAD,1166,000003-018475,1,13886,R,DRAKE DAVID L SR & LANA S,,PO BOX 8532,,LUMBERTON,TX,77657,0532,053,CAD,CH,SS,F2,,,,,,,,,False,,TUCKER RD,,SILSBEE,TX,77656,,,,False,False,C1,,,,1.000000,0,0.00,,,,0.6200,AB 3 S P BANKSTON,,P# 3-245-E,,,,,,,,9130,0,0,0,0,0,0,0,9130,9130,0,0,0,0,0,0,0,0,0,0,0,0,0,False,0,False,False,0,0,0
2021,CAD,CAD,1192,000003-019172,1,13512,R,DODD JERRY,,#4 BRIARWICK,,LUMBERTON,TX,77657,,053,CAD,CH,SS,F2,,,,,,,,,False,8351,BRYANT,,SILSBEE,TX,77656,,,,False,False,F1,,,DODD AIR CONDITIONING COMPANY,1.000000,0,0.00,,,,2.0300,AB 3 S P BANKSTON,SHOP/STORAGE/OFFICE,P# 3-256-D-3,,,,,,,,0,29900,0,0,0,0,0,0,166990,166990,0,0,0,0,0,0,0,0,0,0,0,137090,0,False,0,False,False,0,0,0
2021,CAD,CAD,1215,000003-020050,1,107750,R,BAXLEY WILLIAM K JR & TRACEY L,,8518 SKINNER,,SILSBEE,TX,77656,,053,CAD,CH,SS,F2,,,,,,,,,False,,NEYLAND RD,,SILSBEE,TX,77656,,,,False,True,E,,,,1.000000,0,0.00,H,,,7.6100,AB 3 S P BANKSTON,,P# 3-261-B,I# 2017-80761   12/14/17,,,,,,,23840,0,0,0,0,0,0,0,23840,17580,0,0,0,0,0,0,0,0,0,0,0,0,0,False,0,False,False,0,0,0
2021,CAD,CAD,1223,000003-020300,1,27329,R,LASKOSKIE JOHNNIE J,,2414 NEYLAND RD,,SILSBEE,TX,77656,8002,053,CAD,CH,SS,F2,,,,,,,,,False,2414,NEYLAND RD,,SILSBEE,TX,77656,,,,False,False,A2,,,,1.000000,0,0.00,H,,,1.0000,AB 3 S P BANKSTON,1975  14X70  YELLOW/WHITE,P# 3-265   HCAD# 4264,,,,,,,,14730,0,0,0,0,0,0,0,29220,23330,0,0,0,0,0,0,0,0,0,14490,0,0,0,False,0,False,False,0,0,0
2021,CAD,CAD,1230,000003-020650,1,110753,R,JUDALET DOUGLAS WADE,,7381 MARICLE LN,,SILSBEE,TX,77656,,053,CAD,CH,SS,F2,,,,,,,,,False,7381,MARICLE LN,,SILSBEE,TX,77656,,,,False,False,A1,,,,1.000000,0,0.00,H,,,1.2800,AB 3 S P BANKSTON,,P# 3-273,I# 2018-90666   12/4/2018,,,,,,,18850,0,0,0,0,0,0,0,59650,48600,0,0,0,0,0,0,0,0,0,40800,0,0,0,False,0,False,False,0,0,0
2021,CAD,CAD,1253,000003-021552,1,84843,R,EZERNACK SHAWN,,7461 HICKS DAIRY RD,,SILSBEE,TX,77656,,053,CAD,CH,SS,F2,,,,,,,,,False,7461,HICKS DAIRY RD,,SILSBEE,TX,77656,,,,False,False,A1,,,,1.000000,0,0.00,,,,0.5000,AB 3 S P BANKSTON,,P# 3-291-D,I# 2012-34004   12/26/12,,,,,,,7370,0,0,0,0,0,0,0,33970,33970,0,0,0,0,0,0,0,0,0,26600,0,0,0,False,0,False,False,0,0,0
2021,CAD,CAD,1302,000003-023050,1,49703,R,WILLIAMSON DONALD RAYE,,8072 HICKS DAIRY RD,,SILSBEE,TX,77656,9100,053,CAD,CH,SS,F2,,,,,,,,,False,8072,HICKS DAIRY RD,,SILSBEE,TX,77656,,,,False,False,E1,,,,1.000000,0,0.00,H,,,6.0000,AB 3 S P BANKSTON,,P# 3-313-B,I# 970/515,,,,,,,53700,0,0,0,0,0,0,0,158120,127950,0,0,0,0,0,0,0,0,0,104420,0,0,0,False,0,False,False,0,0,0
2021,CAD,CAD,1312,000003-023300,1,96499,R,BABOLIAN LARRY J,,7896 HICKS DAIRY RD,,SILSBEE,TX,77656,,053,CAD,CH,SS,F2,,,,,,,,,False,,HICKS DAIRY RD,,SILSBEE,TX,77656,,,,False,False,C1,,,,1.000000,0,0.00,,,,2.1100,AB 3 S P BANKSTON,,P# 3-318,I# 2013-37262   5/2/13,,,,,,,31080,0,0,0,0,0,0,0,34130,34130,0,0,0,0,0,0,0,0,0,3050,0,0,0,False,0,False,False,0,0,0
2021,CAD,CAD,1324,000003-023601,1,112868,R,DESMOND AARON A & MORGAN,,2618 MERRIMAN ST,,PORT NECHES,TX,77651,4813,053,CAD,CH,SS,F2,,,,,,,,,False,,NEYLAND RD,,SILSBEE,TX,77656,,,,False,False,D1,,,,1.000000,0,0.00,,,,14.3200,AB 3 S P BANKSTON,,P# 3-324-I,I# 2019-98525   09/30/2019,,,,,,,0,0,128160,2150,0,0,0,0,128160,2150,0,0,0,0,0,0,0,0,0,0,0,0,0,False,0,False,False,0,0,0
2021,CAD,CAD,1373,000003-026610,2,113964,R,BAKER BRUCE A,,PO BOX 221,,BAYSIDE,TX,78340,,053,CAD,CH,SS,F2,,,,,,,,,False,,PONDEROSA DR (OFF),,SILSBEE,TX,77656,,,,False,False,C1,,,,0.200000,0,0.00,,,,0.2000,AB 3 S P BANKSTON,UNDIVIDED INTEREST,P# 3-346-A,I# 2020-102980   03/25/2020,,,,,,,2950,0,0,0,0,0,0,0,2950,2950,0,0,0,0,0,0,0,0,0,0,0,0,0,False,0,False,False,0,0,0
2021,CAD,CAD,1395,000003-027200,2,110755,R,HOWELL CHARLES MICHAEL,LIFE ESTATE,1629 NEYLAND RD,,SILSBEE,TX,77656,,053,CAD,CH,SS,F2,,,,,,,,,False,1629,NEYLAND RD,,SILSBEE,TX,77656,,,,False,False,A1,,,,0.500000,0,0.00,H,,,0.3800,AB 3 S P BANKSTON,50[%] UNDIVIDED INTEREST IN 0.7600 AC,P# 3-356,I# 2018-91288 & 2018-91289,,,,,,,5600,0,0,0,0,0,0,0,33790,28040,0,0,0,0,0,0,0,0,0,28190,0,0,0,False,0,False,False,0,0,0
2021,CAD,CAD,1398,000003-027300,1,115557,R,MCGALLION CHRISTOPHER,,1579 NEYLAND RD,,SILSBEE,TX,77656,,053,CAD,CH,SS,F2,,,,,,,,,False,1579,NEYLAND RD,,SILSBEE,TX,77656,,,,False,False,A1,,,,1.000000,0,0.00,,,,0.5850,AB 3 S P BANKSTON,,P# 3-358,I# 2020-107975   9/29/2020,,,,,,,8620,0,0,0,0,0,0,0,87450,87450,0,0,0,0,0,0,0,0,0,78830,0,0,0,False,0,False,False,0,0,0
2021,CAD,CAD,1412,000003-027750,1,100047,R,GOLDEN JOHN H JR,,PO BOX 8329,,LUMBERTON,TX,77657,,053,CAD,CH,SS,F2,,,,,,,,,False,7205,GOLDEN LN,,SILSBEE,TX,77656,,15D,,False,False,E1,,,,1.000000,0,0.00,,,,3.0600,AB 3 S P BANKSTON,,P# 3-365-A,I# 2014-49032   08/14/2014,,,,,,,15390,0,0,0,0,0,0,0,100500,100500,0,0,0,0,0,0,0,0,0,85110,0,0,0,False,0,False,False,0,0,0
2021,CAD,CAD,1414,000003-027800,1,92886,R,DONALSON J DREW,,PO BOX 684,,SILSBEE,TX,77656,,053,CAD,CH,SS,F2,,,,,,,,,False,,NEYLAND RD,,SILSBEE,TX,77656,,,,False,False,C1,,,,1.000000,0,0.00,,,,0.3500,AB 3 S P BANKSTON,,P# 3-366,I# 2011-21940   05/27/2011,,,,,,,800,0,0,0,0,0,0,0,800,800,0,0,0,0,0,0,0,0,0,0,0,0,0,False,0,False,False,0,0,0
2021,CAD,CAD,1436,000003-028411,1,4550,R,BISKAMP KEVIN,ROBERT & DORIS BISKAMP,1490 KIRBY AVE,,SILSBEE,TX,77656,3718,053,CAD,CH,SS,F2,,,,,,,,,False,,OLD MAID RD,,SILSBEE,TX,77656,,,,False,False,M1,,,,1.000000,0,0.00,,,,0.0000,1994  16X80  WHITE/BROWN,TRA192672,P# 3-380-X-B   HCAD# 12759,,,,,,,,0,0,0,0,0,0,0,0,32970,32970,0,0,0,0,0,0,0,0,0,32970,0,0,0,False,0,False,False,0,0,0
2021,CAD,CAD,1462,000003-037250,1,112251,R,ANAYA JOSE CARMEN,,3900 FM 418,,KOUNTZE,TX,77625,,053,CAD,CH,SS,F2,,,,,,,,,False,1970,NEYLAND RD,,SILSBEE,TX,77656,,,,False,False,A1,,,,1.000000,0,0.00,,,,1.0000,AB 3 S P BANKSTON,,P# 3-400,I# 2019-96094   06/28/2019,,,,,,,14730,0,0,0,0,0,0,0,85160,85160,0,0,0,0,0,0,0,0,0,70430,0,0,0,False,0,False,False,0,0,0
2021,CAD,CAD,1528,000004-000800,1,99027,R,GARDNER BENNY J,,PO BOX 665,,SILSBEE,TX,77656,,053,CAD,CH,SS,F2,,,,,,,,,False,7385,FM 2937,,SILSBEE,TX,77656,,,,False,False,C1,,,,1.000000,0,0.00,,,,2.5440,AB 4 G W BROOKS,SEE NOTES,P# 4-15,I# 2014-47330   6/3/14,,,,,,,37470,0,0,0,0,0,0,0,37470,37470,0,0,0,0,0,0,0,0,0,0,0,0,0,False,0,False,False,0,0,0
2021,CAD,CAD,1565,000004-001520,1,104807,R,KIRKENDALL AMY,,8165 SPERLING LN,,SILSBEE,TX,77656,,053,CAD,CH,SS,F2,,,,,,,,,False,8165,SPERLING LN,,SILSBEE,TX,77656,,,,False,False,A2,,,,1.000000,0,0.00,H,,,3.1210,AB 4 G W BROOKS   TRACT 6,1975  14X60  WHITE/BLACK,P# 4-24-C   HCAD# 5533,I# 2016-63288   03/17/2016,,,,,,,45970,0,0,0,0,0,0,0,49590,24640,0,0,0,0,0,0,0,0,0,3620,0,0,0,False,0,False,False,0,0,0
2021,CAD,CAD,1586,000004-002208,1,11972,R,CRYER DORIS E,,PO BOX 682,,SILSBEE,TX,77656,0682,053,CAD,CH,SS,F2,,,,,,,,,False,,KING FISHER,,SILSBEE,TX,77656,,,,False,False,A1,,,,1.000000,0,0.00,H,,,1.0000,AB 4 G W BROOKS,,P# 4-33-D       TRACT 3,I# 908/299,,,,,,,14730,0,0,0,0,0,0,0,82430,67180,0,0,0,0,0,0,0,0,0,67700,0,0,0,False,0,False,False,0,0,0
2021,CAD,CAD,1663,000004-004550,1,117218,R,SCHATTE WALTER & BRANDIE,,11456 CRAVENS CAMP RD,,SILSBEE,TX,77656,,053,CAD,CH,SS,F2,,,,,,,,,False,11456,CRAVENS CAMP RD,,SILSBEE,TX,77656,,,,False,False,C1,,,,1.000000,0,0.00,,,,2.2600,AB 4 G W BROOKS,M/H PID# 58634,P# 4-70,I# 2021-113607  4/9/2021,,,,,,,23300,0,0,0,0,0,0,0,23300,23300,0,0,0,0,0,0,0,0,0,0,0,0,0,False,0,False,False,0,0,0