Year,Jurisdiction,Jur_Name,Parcel_ID,Account,Location_Code,Jur1,Jur2,Jur 3,Jur 4,Jur 5,Jur 6,Jur 7,Jur 8,Jur 9,Jur 10,Jur 11,Jur 12,Is_Exempt,Prop_Street_Number,Prop_Street,Prop_Street_Dir,Prop_City,Prop_State,Prop_Zip5,Prop_Zip4,Owner_Id,Owner_Prefix,Name,Careof,Street,Street_Overflow,City,State,Zip5,Zip4,Interest,Ceiling_Year,Ceiling_Tax,Homestead_Code,Agent_Code,Acres,Legal1,Legal2,Legal3,Mortgage_Code,Land_Hs,Land_Nhs,Land_Productivity_Market,Land_1d1,Land_1d,Land_Timber,Personal_Hs,Personal_Nhs,Market_Value,Net_Taxable_Value,State_Homestead,State_Mandated_Over65,State_Mandated_Disabled,Optional65,Local_Disabled,Road_Homestead,Disabled_Veteran,New_Personal_Hs,New_Personal_Nhs,Improvement_Hs,New_Improvement_Hs,Improvement_Nhs,New_Improvement_Nhs,Is_Owner_Confidential,Local_Discount,Map1,Map2,Ownership_Sequence,Is_Protested,Has_Hs_Link,Primary_Category_Code,Secondary_Category_Code,Third_Category_Code,DBA,Has_Abatement,Has_Miscellaneous_Exemption,Name1,Legal4
2020,CAD,CAD,61,000002-002390,070,CAD,CH,TL,SL,ML,F1,,,,,,,False,,LHS DR,N,LUMBERTON,TX,77657,,16686,R,FRANKLIN BOBBY Q,,420 N LHS DR,,LUMBERTON,TX,77657,8645,1.000000,0,0.00,,,1.5070,AB 2 F ARRIOLA TR 2 MINOR PLAT,OF BOBBY FRANKLIN,P# 2-10-M,,0,0,65640,0,0,480,0,0,65640,480,0,0,0,0,0,0,0,0,0,0,0,0,0,False,0,,,1,False,False,D1,,,,False,False,,I# 1130/719
2020,CAD,CAD,92,000002-002520,070,CAD,CH,TL,SL,ML,F1,,,,,,,False,1190,CHANCE CUTOFF SP2,W,LUMBERTON,TX,77657,,5237,R,BOOTH ZELMA,OAK LN MH PK #2,1190 W CHANCE RD TRLR 2,,LUMBERTON,TX,77657,,1.000000,0,0.00,,996,0.0000,1984  18X60  BROWN/TAN  TEX0416114,LAND PID# 90,P# 2-13   HCAD# 15060,,0,0,0,0,0,0,0,0,8100,8100,0,0,0,0,0,0,0,0,0,8100,0,0,0,False,0,,,1,False,False,M1,,,,False,False,INCORRECT ADDRESS CODE,
2020,CAD,CAD,127,000002-002800,070,CAD,CH,TL,SL,ML,F1,,,,,,,False,65,REDBUD LN,,LUMBERTON,TX,77657,,112381,R,LEWIS MARGARET A,,65 RED BUD LN,,LUMBERTON,TX,77657,,1.000000,0,0.00,H,,0.9200,AB 2 F ARRIOLA,,P# 2-19   TRACT 14,,38640,0,0,0,0,0,0,0,81020,81020,0,0,0,0,0,0,0,0,0,42380,0,0,0,False,0,,,1,False,False,A1,,,,False,False,,I# 2019-97299  8/13/2019
2020,CAD,CAD,139,000002-003601,070,CAD,CH,TL,SL,ML,F1,,,,,,,False,107,HARRELL RD,,LUMBERTON,TX,77657,,91935,R,BAIRD ROGER,,PO BOX 8611,,LUMBERTON,TX,77657,,1.000000,0,0.00,,,2.3300,AB 2 F ARRIOLA,,P# 2-27-A,,58250,0,0,0,0,0,0,0,198810,198810,0,0,0,0,0,0,0,0,0,140560,0,0,0,False,0,,,1,False,False,A1,,,,False,False,,I# 2012-25448   01/06/2012
2020,CAD,CAD,168,000002-004550,070,CAD,CH,TL,SL,ML,F1,,,,,,,False,945,CHANCE RD CUTOFF,W,LUMBERTON,TX,77657,,25175,R,JONES OTTIS LAMAR & PAULA A,,945 WEST CHANCE CUTOFF,,LUMBERTON,TX,77657,,1.000000,0,0.00,H,,1.0300,AB 2 F ARRIOLA,,P# 2-42   TRACT 51,,37080,0,0,0,0,0,0,0,78100,78100,0,0,0,0,0,0,0,0,0,41020,0,0,0,False,0,,,1,False,False,A1,,,,False,False,,
2020,CAD,CAD,203,000002-005900,070,CAD,CH,TL,SL,ML,F1,,,,,,,False,70,JORDAN DR,,LUMBERTON,TX,77657,,22870,R,HOLTON BETTY,,70 JORDAN DR,,LUMBERTON,TX,77657,6935,1.000000,0,0.00,H,,0.4230,AB 2 F ARRIOLA,,P# 2-63   TRACT 52,,17770,0,0,0,0,0,0,0,47460,47460,0,0,0,0,0,0,0,0,0,29690,0,0,0,False,0,,,1,False,False,A1,,,,False,False,,
2020,CAD,CAD,214,000002-006300,070,CAD,CH,TL,SL,ML,F1,,,,,,,False,680,JORDAN DR,,LUMBERTON,TX,77657,,95922,R,CHAMPAGNE CHRIS ALLEN & MICHELLE B,,680 JORDAN DR,,LUMBERTON,TX,77657,7654,1.000000,0,0.00,H,,2.5060,AB 2 F ARRIOLA,,P# 2-67,,62650,0,0,0,0,0,0,0,103640,103640,0,0,0,0,0,0,0,0,0,40990,0,0,0,False,0,,,1,False,False,A1,,,,False,False,,I# 2013-35674   3/6/13
2020,CAD,CAD,221,000002-006600,070,CAD,CH,TL,SL,ML,F1,,,,,,,False,540,JORDAN DR,,LUMBERTON,TX,77657,,8559,R,CARRUTH CLAUDE M,,540 JORDAN DR,,LUMBERTON,TX,77657,7030,1.000000,0,0.00,H,,3.3600,AB 2 F ARRIOLA,,P# 2-72,,84000,0,0,0,0,0,0,0,137990,137990,0,0,0,0,0,0,0,0,0,53990,0,0,0,False,0,,,1,False,False,A1,,,,False,False,,I# 440/436
2020,CAD,CAD,224,000002-006750,070,CAD,CH,TL,SL,ML,F1,,,,,,,False,520,JORDAN DR,,LUMBERTON,TX,77657,,46226,R,TRIMBLE CARLTON G,,520 JORDAN DR,,LUMBERTON,TX,77657,7030,1.000000,0,0.00,H,,0.9980,AB 2 F ARRIOLA,,P# 2-74,,41920,0,0,0,0,0,0,0,123100,123100,0,0,0,0,0,0,0,0,0,81180,0,0,0,False,0,,,1,False,False,A1,,,,False,False,,I# 1067/529
2020,CAD,CAD,238,000002-007100,070,CAD,CH,TL,SL,ML,F1,,,,,,,False,525,JORDAN DR,,LUMBERTON,TX,77657,,93360,R,MCCULLOUGH JOSHUA D,,525 JORDAN DR,,LUMBERTON,TX,77657,6996,1.000000,0,0.00,H,,3.6250,TRACT 2 MINOR PLAT OF NEWELL SUB,AB 2 F ARRIOLA,P# 2-80,,90630,0,0,0,0,0,0,0,143590,143590,0,0,0,0,0,0,0,0,0,52960,0,0,0,False,0,,,1,False,False,A1,,,,False,False,,I# 2018-90898   12/12/2018
2020,CAD,CAD,254,000002-007400,047,CAD,CH,SL,ML,F1,,,,,,,,False,,HICKORY HOLLOW DR,,LUMBERTON,TX,77657,,6034,R,BOZEMAN JAMES H,,7980 LAURIE LN,,LUMBERTON,TX,77657,6813,1.000000,0,0.00,,,9.9100,AB 2 F ARRIOLA,,P# 2-83-C,,0,0,58220,0,0,3880,0,0,66110,11770,0,0,0,0,0,0,0,0,0,0,0,7890,0,False,0,,,1,False,False,D1,D2,,,False,False,,
2020,CAD,CAD,257,000002-007455,047,CAD,CH,SL,ML,F1,,,,,,,,False,7622,HICKORY HOLLOW DR,,LUMBERTON,TX,77657,,49302,R,HEBERT BEVERLY BOZEMAN,,2395 HEBERT RD,,BEAUMONT,TX,77705,,1.000000,0,0.00,,,0.0000,HOUSE ONLY,LAND PID 256,P# 2-83-D,,0,0,0,0,0,0,0,0,76070,76070,0,0,0,0,0,0,0,0,0,76070,0,0,0,False,0,,,1,False,False,M1,,,,False,False,,
2020,CAD,CAD,274,000002-007900,047,CAD,CH,SL,ML,F1,,,,,,,,False,4675,SPILLERS RD,,LUMBERTON,TX,77657,,113733,R,JONES KEVIN E,,4675 SPILLERS RD,,LUMBERTON,TX,77657,,1.000000,0,0.00,H,,3.0300,AB 2 F ARRIOLA,MOBILE HOME PID# 80133,P# 2-88-D       TRACTS 5 & 6,,22730,0,0,0,0,0,0,0,22730,22730,0,0,0,0,0,0,0,0,0,0,0,0,0,False,0,,,1,False,True,A2,,,,False,False,,I# 2020-101024   01/08/2020
2020,CAD,CAD,278,000002-008050,047,CAD,CH,SL,ML,F1,,,,,,,,False,4615,SPILLERS RD,,LUMBERTON,TX,77657,,113154,R,BATES STEPHEN & MONICA,,4615 SPILLERS,,LUMBERTON,TX,77657,,1.000000,0,0.00,,,1.5100,AB 2 F ARRIOLA,MOBILE HOME PID# 82007,P# 2-88-G       TRACT 2,,11330,0,0,0,0,0,0,0,11330,11330,0,0,0,0,0,0,0,0,0,0,0,0,0,False,0,,,1,False,False,A2,,,,False,False,,I# 2019-100132   12/03/2019
2020,CAD,CAD,312,000002-008605,047,CAD,CH,SL,ML,F1,,,,,,,,True,,,,LUMBERTON,TX,77657,,9882,R,CITY OF LUMBERTON,,836 N MAIN ST,,LUMBERTON,TX,77657,6309,1.000000,0,0.00,,,102.0900,AB 2 F ARRIOLA,AB 2 = 99.903 -/AB 1 =2.187,P# 2-104-1   TRACT 99F,,0,183760,0,0,0,0,0,0,183760,0,0,0,0,0,0,0,0,0,0,0,0,0,0,False,0,,,1,False,False,XV,,,,False,False,,
2020,CAD,CAD,324,000002-008706,047,CAD,CH,SL,ML,F1,,,,,,,,False,7144,HICKORY HOLLOW DR,,LUMBERTON,TX,77657,,6790,R,BROWN JOHN P & AMY,,7144 HICKORY HOLLOW DR,,LUMBERTON,TX,77657,9772,1.000000,0,0.00,H,,0.0000,HOUSE ONLY,LAND PID# 320,P# 2-106,,0,0,0,0,0,0,0,0,162000,162000,0,0,0,0,0,0,0,0,0,162000,0,0,0,False,0,,,1,False,False,A4,,,,False,False,,
2020,CAD,CAD,341,000002-009160,047,CAD,CH,SL,ML,F1,,,,,,,,False,6422,FAWN DR,N,LUMBERTON,TX,77657,,92847,R,CALLOWAY KENWORD J,,6422 N FAWN DR,,LUMBERTON,TX,77657,,1.000000,0,0.00,H,,1.4990,LOT 206A ARRIOLA ACRES,AB 2 F ARRIOLA,P# 2-110-A-1-A,,35980,0,0,0,0,0,0,0,84610,58770,0,0,0,0,0,0,0,0,0,48630,0,0,0,False,0,,,1,False,False,A1,,,,False,False,,I# 2011-21824   8/2/11
2020,CAD,CAD,347,000002-009267,047,CAD,CH,SL,ML,F1,,,,,,,,False,6815,FAWN DR,N,LUMBERTON,TX,77657,,110893,R,LEBLANC TROY & TAMMY,,6815 N FAWN DR,,LUMBERTON,TX,77657,,1.000000,0,0.00,H,,5.0000,LOTS 126 & 127 ARRIOLA ACRES,AB 2 F ARRIOLA,P# 2-110-A-6,,60000,0,0,0,0,0,0,0,208990,208990,0,0,0,0,0,0,0,0,0,148990,0,0,0,False,0,,,1,False,False,E1,,,,False,False,,I# 2019-91836   1/22/2019
2020,CAD,CAD,348,000002-009269,047,CAD,CH,SL,ML,F1,,,,,,,,False,4060,LANG LN,,LUMBERTON,TX,77657,,97935,R,STARY RANDY,,4060 LANG LN,,LUMBERTON,TX,77657,,1.000000,0,0.00,,,1.0000,LOT 8 AB 2 F ARRIOLA,MOBILE HOME PID# 62669,P# 2-110-A-7,,24000,0,0,0,0,0,0,0,24000,24000,0,0,0,0,0,0,0,0,0,0,0,0,0,False,0,,,1,False,False,C1,,,,False,False,,I# 2014-44722   02/21/2014
2020,CAD,CAD,359,000002-009356,047,CAD,CH,SL,ML,F1,,,,,,,,False,4336,WILSON LN,,LUMBERTON,TX,77657,,41128,R,SIMMONS TONY,,4336 WILSON LN,,LUMBERTON,TX,77657,6716,1.000000,0,0.00,,,2.9600,LOT 216 ARRIOLA ACRES,AB 2 F ARRIOLA,P# 2-110-BB-7,,56240,0,0,0,0,0,0,0,56240,56240,0,0,0,0,0,0,0,0,0,0,0,0,0,False,0,,,1,False,False,A2,,,,False,False,,
2020,CAD,CAD,367,000002-009366,047,CAD,CH,SL,ML,F1,,,,,,,,False,1743,SPELL LN,,LUMBERTON,TX,77657,,67269,R,WELCH SHELIA,,1743 SPELL LN,,LUMBERTON,TX,77657,6781,1.000000,0,0.00,H,,2.5000,LOT 233 ARRIOLA ACRES,1993  28X68  BEIGE/BROWN  TRA0189892,P# 2-110-BB-182   HCAD# 13470,,47500,0,0,0,0,0,0,0,94580,89850,0,0,0,0,0,0,0,0,0,47080,0,0,0,False,0,,,1,False,False,A2,,,,False,False,,I# 1453/307   07/20/2004
2020,CAD,CAD,378,000002-009378,047,CAD,CH,SL,ML,F1,,,,,,,,False,6494,FAWN DR,N,LUMBERTON,TX,77657,,15258,R,EVANS THOMAS CLAUD,,6494 N FAWN DR,,LUMBERTON,TX,77657,6738,1.000000,0,0.00,H,,5.1700,LOT 205  ARRIOLA ACRES,1985  28X52  TAN,P# 2-110-BB-292   HCAD# 14159,,62040,0,0,0,0,0,0,0,101410,101410,0,0,0,0,0,0,0,0,0,39370,0,0,0,False,0,,,1,False,False,E2,,,,False,False,,
2020,CAD,CAD,420,000002-009500,047,CAD,CH,SL,ML,F1,,,,,,,,False,4963,ARIOLA LN,,LUMBERTON,TX,77657,,72645,R,HARRIS KATHY LYNN,,4963 ARIOLA LN,,LUMBERTON,TX,77657,9718,1.000000,0,0.00,H,,1.0000,LOTS 37 & 38 ARRIOLA ACRES,1977  24X56  BEIGE/BROWN  HWC009682,P# 2-110-CC-2   HCAD# 14142,,24000,0,0,0,0,0,0,0,34150,34150,0,0,0,0,0,0,0,0,0,10150,0,0,0,False,0,,,1,False,False,A2,,,,False,False,,
2020,CAD,CAD,458,000002-010510,047,CAD,CH,SL,ML,F1,,,,,,,,False,7036,JOHNSON LN,,LUMBERTON,TX,77657,,4539,R,BISHOP PARKER & DOROTHY-LIFE ESTATE,,7036 JOHNSON LN,,LUMBERTON,TX,77657,7505,1.000000,0,0.00,H,,20.0000,LT 318 & PT OF 320 ARRIOLA AC,1995  16X76  CAVALIER GRAY,P# 2-110-M-5   HCAD# 7284,,79200,0,0,0,0,0,0,0,106870,61600,0,0,0,0,0,0,0,0,0,27670,0,0,0,False,0,,,1,False,False,E2,,,,False,False,,I# 2014-49887   09/18/2014
2020,CAD,CAD,485,000002-011005,047,CAD,CH,SL,ML,F1,,,,,,,,False,5010,ARIOLA LN,,LUMBERTON,TX,77657,,109786,R,LEGER DYLLON D & KENDALL C,,5010 ARIOLA,,LUMBERTON,TX,77657,,1.000000,0,0.00,H,,2.5000,LOT 117 ARRIOLA ACRES,1999  28X76  BEIGE/GREEN  TRA0440119/20,P# 2-110-U-1   HCAD# 7924,,47500,0,0,0,0,0,0,0,85930,85930,0,0,0,0,0,0,0,0,0,38430,0,0,0,False,0,,,1,False,False,A2,,,,False,False,,I# 2017-74598 & 2018-84309
2020,CAD,CAD,504,000002-011366,047,CAD,CH,SL,ML,F1,,,,,,,,False,3966,SHEFFIELD LN,,LUMBERTON,TX,77657,,40520,R,SHEFFIELD RUBY,,3966 SHEFFIELD LN,,LUMBERTON,TX,77657,6772,1.000000,0,0.00,H,,2.0000,LOT 204-E ARRIOLA ACRES,AB 2 F ARRIOLA,P# 2-110-CCC,,38000,0,0,0,0,0,0,0,45180,40030,0,0,0,0,0,0,0,0,0,7180,0,0,0,False,0,,,1,False,False,A1,,,,False,False,,I# 733/417
2020,CAD,CAD,530,000002-011408,047,CAD,CH,SL,ML,F1,,,,,,,,False,6513,JOHNSON LN,,LUMBERTON,TX,77657,,85531,R,JONES GORDON WAYNE & SARAH,,6513 JOHNSON LN,,LUMBERTON,TX,77657,6727,1.000000,0,0.00,,,0.2500,AB 2 F ARRIOLA,,P# 2-110-RRR-1-A-1       TRACT P,,6000,0,0,0,0,0,0,0,6000,6000,0,0,0,0,0,0,0,0,0,0,0,0,0,False,0,,,1,False,False,C1,,,,False,False,,I# 1711/607   12/29/08
2020,CAD,CAD,548,000002-011575,047,CAD,CH,SL,ML,F1,,,,,,,,False,6993,JOHNSON LN,,LUMBERTON,TX,77657,,72646,R,HAVENS BERT & BETH,,6993 JOHNSON LN,,LUMBERTON,TX,77657,6733,1.000000,0,0.00,H,,2.9500,LOT 321 ARRIOLA ACRES,1984  14X80,P# 2-125        HCAD# 4216,,56050,0,0,0,0,0,0,0,65700,55920,0,0,0,0,0,0,0,0,0,9650,0,0,0,False,0,,,1,False,False,A2,,,,False,False,,
2020,CAD,CAD,560,000002-011610,047,CAD,CH,SL,ML,F1,,,,,,,,False,5092,ARIOLA LN,,LUMBERTON,TX,77657,,40090,R,SEAMAN JACK & LINDA,,5092 ARIOLA LN,,LUMBERTON,TX,77657,9719,1.000000,0,0.00,H,,2.5000,LOT 115 ARRIOLA ACRES,1982  24X60  BEIGE/WOOD,P# 2-132       HCAD# 13440,,47500,0,0,0,0,0,0,0,86240,86240,0,0,0,0,0,0,0,0,0,38740,0,0,0,False,0,,,1,False,False,A2,,,,False,False,,
2020,CAD,CAD,590,000002-012505,070,CAD,CH,TL,SL,ML,F1,,,,,,,False,6690,CARNATION DR,,LUMBERTON,TX,77657,,106386,R,P & D HOUSING LLC,,PO BOX 3007,,THOUSAND OAKS,CA,91359,,1.000000,0,0.00,,,0.0000,1997  26X66  TAN/GREEN  NTA0663542/3,LAND PID# 94,P# 2-10-S        HCAD# 14246,,0,0,0,0,0,0,0,0,9000,9000,0,0,0,0,0,0,0,0,0,0,0,9000,0,False,0,,,1,False,False,F1,,,,False,False,,I# SOL   09/18/2017
2020,CAD,CAD,592,000002-012507,070,CAD,CH,TL,SL,ML,F1,,,,,,,False,5517,SUMMERVILLE DR,,LUMBERTON,TX,77657,,102028,R,SHELBURNE JOYS E,,8289 CROSSWIND,,LUMBERTON,TX,77657,,1.000000,0,0.00,,,0.0000,1995  14X66  GRAY/WHITE  GEO0849830,LOT 5 BLK 1 SUMMERVILLE MHP   LAND PID# 00094,P# 2-10-S        HCAD# 14608,,0,0,0,0,0,0,0,0,20880,20880,0,0,0,0,0,0,0,0,0,20880,0,0,0,False,0,,,1,False,False,M1,,,,False,False,,I# SOL   10/22/2015
2020,CAD,CAD,613,000002-012528,070,CAD,CH,TL,SL,ML,F1,,,,,,,False,6658,DAISY LN,,LUMBERTON,TX,77657,,106386,R,P & D HOUSING LLC,,PO BOX 3007,,THOUSAND OAKS,CA,91359,,1.000000,0,0.00,,,0.0000,1998  16X76  NAVY/WOODGRAIN  GEO1131016,LAND PID #94,P# 2-10-S       HCAD# 16062,,0,0,0,0,0,0,0,0,9090,9090,0,0,0,0,0,0,0,0,0,0,0,9090,0,False,0,,,1,False,False,F1,,,,False,False,,
2020,CAD,CAD,616,000002-012531,070,CAD,CH,TL,SL,ML,F1,,,,,,,False,6695,DAISY LN,,LUMBERTON,TX,77657,,93618,R,GOLD STEVEN & DONNA,,6695 DAISY,,LUMBERTON,TX,77657,,1.000000,0,0.00,H,320,0.0000,1996  28X66  BEIGE/GREEN  NTA602537/8,LOT 10 BLK 10 SUMMERVILLE MHP,P# 2-10-S        HCAD# 16063,,0,0,0,0,0,0,0,0,23750,23750,0,0,0,0,0,0,0,0,0,23750,0,0,0,False,0,,,1,False,False,M1,,,,False,False,TINA M LEE,I# SOL   08/12/2011     LAND PID #00094
2020,CAD,CAD,639,000003-000450,053,CAD,CH,SS,F2,,,,,,,,,False,8603,BUSSEY RD,,SILSBEE,TX,77656,,78252,R,NOLEN PRESLEY D & DONNA R,,1823 S WILLIAMS LN,,SILSBEE,TX,77656,8336,1.000000,0,0.00,H,,10.0000,AB 3 S P BANKSTON,,P# 3-5-A,,60000,0,0,0,0,0,0,0,76100,76100,0,0,0,0,0,0,0,0,0,16100,0,0,0,False,0,,,1,False,False,E1,,,,False,False,,I# 1541/262   2/2/06
2020,CAD,CAD,669,000003-000850,053,CAD,CH,SS,F2,,,,,,,,,False,8431,COLE LN,,SILSBEE,TX,77656,,21492,R,HEAD LINDA SUE,,8431 COLE LN,,SILSBEE,TX,77656,6443,1.000000,0,0.00,H,,1.0000,AB 3 S P BANKSTON,,P# 3-8   PT OF TRACT 6,,10000,0,0,0,0,0,0,0,71470,70520,0,0,0,0,0,0,0,0,0,61470,0,0,0,False,0,,,1,False,False,A1,,,,False,False,,I# 994/134
2020,CAD,CAD,672,000003-001100,053,CAD,CH,SS,F2,,,,,,,,,False,8378,COLE LN,,SILSBEE,TX,77656,,20272,R,HANKS HAROLD ET UX,,120 SEAMAN DR,,SILSBEE,TX,77656,,1.000000,0,0.00,,,1.5000,AB 3 S P BANKSTON,,P# 3-14,,15000,0,0,0,0,0,0,0,91330,91330,0,0,0,0,0,0,0,0,0,76330,0,0,0,False,0,,,1,False,False,A1,,,,False,False,,
2020,CAD,CAD,678,000003-001350,053,CAD,CH,SS,F2,,,,,,,,,False,8431,BUSSEY RD,,SILSBEE,TX,77656,,72201,R,CARTER JOSEPH & DIANA,,PO BOX 1902,,SILSBEE,TX,77656,1902,1.000000,0,0.00,,,1.0600,AB 3 S P BANKSTON,,P# 3-19,,10600,0,0,0,0,0,0,0,10600,10600,0,0,0,0,0,0,0,0,0,0,0,0,0,False,0,,,1,False,False,C1,,,,False,False,,I# 1776/85
2020,CAD,CAD,688,000003-001500,053,CAD,CH,SS,F2,,,,,,,,,False,,BUSSEY RD,,SILSBEE,TX,77656,,19127,R,GREENWOOD CLAUDE MRS,,LAST KNOWN ADDRESS INCORRECT/,CURRENT ADDRESS UNKNOWN,,,,,1.000000,0,0.00,,996,1.0000,AB 3 S P BANKSTON,,P# 3-21,,10000,0,0,0,0,0,0,0,10000,10000,0,0,0,0,0,0,0,0,0,0,0,0,0,False,0,,,1,False,False,C1,,,,False,False,INCORRECT ADDRESS CODE,
2020,CAD,CAD,721,000003-002305,053,CAD,CH,SS,F2,,,,,,,,,False,9149,BUSSEY RD,,SILSBEE,TX,77656,,18981,R,GRAY MARTHA,,9149 BUSSEY RD,,SILSBEE,TX,77656,8346,1.000000,0,0.00,,,0.5970,AB 3 S P BANKSTON,VLB #571-119752,P# 3-37,,0,5970,0,0,0,0,0,0,5970,5970,0,0,0,0,0,0,0,0,0,0,0,0,0,False,0,,,1,False,False,E,,,,False,False,,
2020,CAD,CAD,729,000003-002450,053,CAD,CH,SS,F2,,,,,,,,,False,9082,BAUMANN DR,,SILSBEE,TX,77656,,49749,R,WILLIAMSON MILDRED LOUISE,ATTN: JANET W FREEMAN,9082 BAUMANN DR,,SILSBEE,TX,77656,7797,1.000000,0,0.00,,,4.2200,AB 3 S P BANKSTON,,P# 3-40,,42200,0,0,0,0,0,0,0,72500,72500,0,0,0,0,0,0,0,0,0,30300,0,0,0,False,0,,,1,False,False,A1,,,,False,False,,
2020,CAD,CAD,740,000003-002800,053,CAD,CH,SS,F2,,,,,,,,,False,9075,WILLIS RD,,SILSBEE,TX,77656,,88681,R,TARVER MELISSA K,,9075 WILLIS RD,,SILSBEE,TX,77656,8326,1.000000,0,0.00,,,0.7610,AB 3 S P BANKSTON,2014  26X52  BEIGE/WHITE/MAROON,P# 3-43  HCAD# 11475,,7610,0,0,0,0,0,0,0,53000,53000,0,0,0,0,0,0,0,0,0,45390,0,0,0,False,0,,,1,False,False,A1,,,,False,False,,I# 1781/237   11/13/2001
2020,CAD,CAD,766,000003-003750,053,CAD,CH,SS,F2,,,,,,,,,False,2744,FM 92,,SILSBEE,TX,77656,,105392,R,ODOM MARVIN & MARLINDA,,2744 FM 92,,SILSBEE,TX,77656,,1.000000,0,0.00,H,,2.4500,AB 3 S P BANKSTON,,P# 3-61,,24500,0,0,0,0,0,0,0,156650,156650,0,0,0,0,0,0,0,0,0,132150,0,0,0,False,0,,,1,False,False,A1,,,,False,False,,I# 2017-71444
2020,CAD,CAD,790,000003-004626,053,CAD,CH,SS,F2,,,,,,,,,False,8631,WILLIS RD,,SILSBEE,TX,77656,,3259,R,BARNETT EMMETT L & TERESA,,8631 WILLIS RD,,SILSBEE,TX,77656,8047,1.000000,0,0.00,H,,2.9110,AB 3 S P BANKSTON,,P# 3-71-C,,29110,0,0,0,0,0,0,0,67380,67380,0,0,0,0,0,0,0,0,0,38270,0,0,0,False,0,,,1,False,False,A2,,,,False,False,,
2020,CAD,CAD,820,000003-005750,053,CAD,CH,SS,F2,,,,,,,,,False,8446,HEFFNER RD,,SILSBEE,TX,77656,,102262,R,MCDONALD FRANK & MARJORIE F,LIFE ESTATE,PO BOX 2212,,SILSBEE,TX,77656,,1.000000,0,0.00,,,9.9000,AB 3 S P BANKSTON,,P# 3-90,,71400,0,0,0,0,0,0,0,102130,102130,0,0,0,0,0,0,0,0,0,30730,0,0,0,False,0,,,1,False,False,E1,,,,False,False,,I# 2013-38065   05/31/2013
2020,CAD,CAD,833,000003-006350,053,CAD,CH,SS,F2,,,,,,,,,False,8670,WILLIS RD,,SILSBEE,TX,77656,,84909,R,BYLSMA MARIE COLLINS,,8670 WILLIS RD,,SILSBEE,TX,77656,8046,1.000000,0,0.00,H,,0.6600,AB 3 S P BANKSTON,,P# 3-97,,6600,0,0,0,0,0,0,0,55260,55260,0,0,0,0,0,0,0,0,0,48660,0,0,0,False,0,,,1,False,False,A1,,,,False,False,,I# 1702/432   10/22/2008
2020,CAD,CAD,842,000003-006700,053,CAD,CH,SS,F2,,,,,,,,,False,1785,WILLIAMS LN,S,SILSBEE,TX,77656,,30536,R,MCCOLLUM DAVID & SANDRA,,1785 S WILLIAMS LN,,SILSBEE,TX,77656,,1.000000,0,0.00,H,,9.0000,AB 3 S P BANKSTON,,P# 3-104   TRACT 86,,10000,0,48000,1200,0,0,0,0,121930,75130,0,0,0,0,0,0,0,0,0,63930,0,0,0,False,0,,,1,False,False,D1,E1,,,False,False,,I# 1034/861
2020,CAD,CAD,848,000003-006860,053,CAD,CH,SS,F2,,,,,,,,,False,,WILLIAMS LN,S,SILSBEE,TX,77656,,34004,R,NOLEN PRESLEY DALE,,1823 S WILLIAMS LN,,SILSBEE,TX,77656,8336,1.000000,0,0.00,,,0.8000,AB 3 S P BANKSTON,,P# 3-107-B-1,,8000,0,0,0,0,0,0,0,8000,8000,0,0,0,0,0,0,0,0,0,0,0,0,0,False,0,,,1,False,False,C1,,,,False,False,,
2020,CAD,CAD,863,000003-007250,053,CAD,CH,SS,F2,,,,,,,,,False,9056,WILLIS RD,,SILSBEE,TX,77656,,17663,R,GESICKI NANCY KAREN,,9056 WILLIS RD,,SILSBEE,TX,77656,8325,1.000000,0,0.00,H,,2.0000,AB 3 S P BANKSTON,,P# 3-114,,20000,0,0,0,0,0,0,0,68700,68700,0,0,0,0,0,0,0,0,0,48700,0,0,0,False,0,,,1,False,False,A1,,,,False,False,,I# 1301/455
2020,CAD,CAD,867,000003-007350,053,CAD,CH,SS,F2,,,,,,,,,False,,ROACH,,SILSBEE,TX,77656,,7248,R,BULIN ELVA C EST,,ADDRESS UNKNOWN,,,,,,1.000000,0,0.00,,,0.3400,AB 3 S P BANKSTON,,P# 3-116   TRACT 102,,3400,0,0,0,0,0,0,0,3400,3400,0,0,0,0,0,0,0,0,0,0,0,0,0,False,0,,,1,False,False,C1,,,,False,False,,
2020,CAD,CAD,889,000003-008253,053,CAD,CH,SS,F2,,,,,,,,,False,10207,BUSSEY RD (MARTIN LN),,SILSBEE,TX,77656,,28083,R,LIGHTFOOT LARRY,,10207 BUSSEY RD,,SILSBEE,TX,77656,8310,1.000000,0,0.00,H,,0.0000,1970  10X50  WHITE,,P# 3-137-B   HCAD# 8690,,0,0,0,0,0,0,0,0,12010,7940,0,0,0,0,0,0,0,0,0,12010,0,0,0,False,0,,,1,False,False,M1,,,,False,False,,
2020,CAD,CAD,902,000003-008650,053,CAD,CH,SS,F2,,,,,,,,,False,9213,BRITTONVILLE RD,,SILSBEE,TX,77656,,114799,R,LOOPER TIFFANY F,,9213 BRITTONVILEE RD,,SILSBEE,TX,77656,,1.000000,0,0.00,,,1.8000,AB 3 S P BANKSTON,,P# 3-140-A,,18000,0,0,0,0,0,0,0,98920,98920,0,0,0,0,0,0,0,0,0,80920,0,0,0,False,0,,,1,False,False,A1,,,,False,False,,I# 2020-105706 7/14/2020
2020,CAD,CAD,908,000003-008900,053,CAD,CH,SS,F2,,,,,,,,,False,,BUSSEY RD,,SILSBEE,TX,77656,,98655,R,MCGALLION LAURA E &,SANDRA LEE MCGALLION,LAURA MCGALLION,PO BOX 1498,SILSBEE,TX,77656,,1.000000,0,0.00,,,3.3240,AB 3 S P BANKSTON,,P# 3-144,,0,13300,0,0,0,0,0,0,15160,15160,0,0,0,0,0,0,0,0,0,1860,0,0,0,False,0,,,1,False,False,A1,,,,False,False,,
2020,CAD,CAD,936,000003-009762,053,CAD,CH,SS,F2,,,,,,,,,False,2161,WHITEHEAD RD,,SILSBEE,TX,77656,,114779,R,MONDAY ANGELA,,2161 WHITEHEAD DR,,SILSBEE,TX,77656,,1.000000,0,0.00,H,,5.3100,AB 3 S P BANKSTON,,P# 3-155-A-5,,37170,0,0,0,0,0,0,0,72380,72380,0,0,0,0,0,0,0,0,0,35210,0,0,0,False,0,,,1,False,False,E1,,,,False,False,,I# 2020-101524  1/30/2020
2020,CAD,CAD,949,000003-009850,053,CAD,CH,SS,F2,,,,,,,,,False,2014,WHITEHEAD RD,,SILSBEE,TX,77656,,27605,R,LEBLANC MICHAEL & MARLEE,,7417 HUGHES DR,,PLANO,TX,75024,3446,1.000000,0,0.00,H,,0.7800,AB 3 S P BANKSTON,,P# 3-155-C   TRACT 136,,7800,0,0,0,0,0,0,0,77890,77890,0,0,0,0,0,0,0,0,0,70090,0,0,0,False,0,,,1,False,False,A1,,,,False,False,,I# 960/39
2020,CAD,CAD,977,000003-010750,053,CAD,CH,SS,F2,,,,,,,,,False,9479,BUSSEY RD,,SILSBEE,TX,77656,,11825,R,CROSBY WOODROW L & TAMARA,,9479 BUSSEY RD,,SILSBEE,TX,77656,9641,1.000000,0,0.00,H,,2.0000,AB 3 S P BANKSTON,2006  32X68  BEIGE  NTA1404105/6,P# 3-168   HCAD# 5601,,20000,0,0,0,0,0,0,0,76410,76410,0,0,0,0,0,0,0,0,0,56410,0,0,0,False,0,,,1,False,False,A2,,,,False,False,,
2020,CAD,CAD,994,000003-011850,053,CAD,CH,SS,F2,,,,,,,,,False,1725,FM 92,N,SILSBEE,TX,77656,,99889,R,"J MACK ENTERPRISES, INC",,3955 GRIFFIN GROVE,,SILSBEE,TX,77656,,1.000000,0,0.00,,,0.6700,AB 3 S P BANKSTON,,P# 3-183,,0,5360,0,0,0,0,0,0,79980,79980,0,0,0,0,0,0,0,0,0,0,0,74620,0,False,0,,,1,False,False,F1,,,J MACK,False,False,,I# 2014-51176  11/10/2014
2020,CAD,CAD,1023,000003-012700,053,CAD,CH,SS,F2,,,,,,,,,False,2783,NEYLAND RD,,SILSBEE,TX,77656,,84128,R,FREGIA BILLY RICHARD & SUSAN,,2783 NEYLAND RD,,SILSBEE,TX,77656,8706,1.000000,0,0.00,H,,0.5060,AB 3 S P BANKSTON,PINEVIEW TERRACE,P# 3-193-G-1   TRACT 15,,5060,0,0,0,0,0,0,0,89820,80080,0,0,0,0,0,0,0,0,0,84760,0,0,0,False,0,,,1,False,False,A1,,,,False,False,,I# 1685/333   06/09/2008
2020,CAD,CAD,1050,000003-013850,053,CAD,CH,SS,F2,,,,,,,,,False,2492,BUCHANNON RD,,SILSBEE,TX,77656,,104351,R,BEABER JOSHUA W & AMBER N,,2492 BUCHANAN RD,,SILSBEE,TX,77656,,1.000000,0,0.00,H,,0.5050,AB 3 S P BANKSTON,PINEVIEW TERRACE,P# 3-193-M   TRACT 9,,5050,0,0,0,0,0,0,0,70230,70230,0,0,0,0,0,0,0,0,0,65180,0,0,0,False,0,,,1,False,False,A1,,,,False,False,,I# 2016-68638   10/06/2016
2020,CAD,CAD,1056,000003-014000,053,CAD,CH,SS,F2,,,,,,,,,False,7848,FM 1122,,SILSBEE,TX,77656,,18956,R,GRAY JOHNIE MRS,ANELLE COMPTON,PO BOX 994,,SILSBEE,TX,77656,,1.000000,0,0.00,,,4.7890,AB 3 S P BANKSTON,,P# 3-195,,37700,0,0,0,0,0,0,0,45250,45250,0,0,0,0,0,0,0,0,0,7550,0,0,0,False,0,,,1,False,False,A1,,,,False,False,,I# 2014-50142
2020,CAD,CAD,1065,000003-014200,053,CAD,CH,SS,F2,,,,,,,,,False,7550,SANDPIPER LN,,SILSBEE,TX,77656,,25183,R,JONES PENNY,,7524 SANDPIPER LN,,SILSBEE,TX,77656,7404,1.000000,0,0.00,,,0.5550,AB 3 S P BANKSTON,,P# 3-197,,5550,0,0,0,0,0,0,0,35810,35810,0,0,0,0,0,0,0,0,0,30260,0,0,0,False,0,,,1,False,False,A1,,,,False,False,,I# WILL   9/25/12
2020,CAD,CAD,1076,000003-014550,053,CAD,CH,SS,F2,,,,,,,,,False,7776,FM 1122,,SILSBEE,TX,77656,,99746,R,GORE EDDIE & KARI,,PO BOX 2124,,SILSBEE,TX,77656,,1.000000,0,0.00,H,,1.0000,AB 3 S P BANKSTON,,P# 3-203-A,,10000,0,0,0,0,0,0,0,51760,51760,0,0,0,0,0,0,0,0,0,41760,0,0,0,False,0,,,1,False,False,A1,,,,False,False,,I# 2014-51869   12/10/2014
2020,CAD,CAD,1122,000003-016600,053,CAD,CH,SS,F2,,,,,,,,,False,2453,CARROLL LN,,SILSBEE,TX,77656,,110894,R,LAURENT HAROLD & CHRISTIANA,,2453 CARROLL LN,,SILSBEE,TX,77656,,1.000000,0,0.00,,,0.3000,AB 3 S P BANKSTON,LOT 11 CARROLL S/D,P# 3-221,,3000,0,0,0,0,0,0,0,27500,27500,0,0,0,0,0,0,0,0,0,24500,0,0,0,False,0,,,1,False,False,A1,,,,False,False,,I# 2019-91990   1/23/2019
2020,CAD,CAD,1156,000003-018050,053,CAD,CH,SS,F2,,,,,,,,,False,,TUCKER RD,,SILSBEE,TX,77656,,107884,R,VALENZUELA SABINO,,2415 TUCKER RD,,SILSBEE,TX,77656,,1.000000,0,0.00,,,0.5900,AB 3 S P BANKSTON,,P# 3-243-B,,5900,0,0,0,0,0,0,0,5900,5900,0,0,0,0,0,0,0,0,0,0,0,0,0,False,0,,,1,False,False,C1,,,,False,False,,I# 2017-80021   11/27/2017