Year,Jurisdiction,Jur_Name,Parcel_ID,Account,Location_Code,Jur1,Jur2,Jur 3,Jur 4,Jur 5,Jur 6,Jur 7,Jur 8,Jur 9,Jur 10,Jur 11,Jur 12,Is_Exempt,Prop_Street_Number,Prop_Street,Prop_Street_Dir,Prop_City,Prop_State,Prop_Zip5,Prop_Zip4,Owner_Id,Owner_Prefix,Name,Careof,Street,Street_Overflow,City,State,Zip5,Zip4,Interest,Ceiling_Year,Ceiling_Tax,Homestead_Code,Agent_Code,Acres,Legal1,Legal2,Legal3,Mortgage_Code,Land_Hs,Land_Nhs,Land_Productivity_Market,Land_1d1,Land_1d,Land_Timber,Personal_Hs,Personal_Nhs,Market_Value,Net_Taxable_Value,State_Homestead,State_Mandated_Over65,State_Mandated_Disabled,Optional65,Local_Disabled,Road_Homestead,Disabled_Veteran,New_Personal_Hs,New_Personal_Nhs,Improvement_Hs,New_Improvement_Hs,Improvement_Nhs,New_Improvement_Nhs,Is_Owner_Confidential,Local_Discount,Map1,Map2,Ownership_Sequence,Is_Protested,Has_Hs_Link,Primary_Category_Code,Secondary_Category_Code,Third_Category_Code,DBA,Has_Abatement,Has_Miscellaneous_Exemption,Name1,Legal4
2018,CAD,CAD,5,000001-000115,47,CAD,CH,SL,ML,F1,,,,,,,,TRUE,,FM 421,,LUMBERTON,TX,77657,,29120,R,LUMBERTON MUNICIPAL UTILI,,PO BOX 8065,,LUMBERTON,TX,77657,,1,0,0,,,48.094,AB 1 E ARRIOLA,,P# 1-2-E,,0,72140,0,0,0,0,0,0,72140,0,0,0,0,0,0,0,0,0,0,0,0,0,0,FALSE,0,,,1,FALSE,FALSE,XV,,,,FALSE,FALSE,,I# 1372/563
2018,CAD,CAD,23,000002-002000,70,CAD,CH,TL,SL,ML,F1,,,,,,,FALSE,125,DOGWOOD LN,,LUMBERTON,TX,77657,,6439,R,BRISENDINE WENDLYN K,,125 DOGWOOD LN,,LUMBERTON,TX,77657,7122,1,0,0,H,,2.028,AB 2 F ARRIOLA,,P# 2-6   TRACT 8B,,50700,0,0,0,0,0,0,0,128780,128780,0,0,0,0,0,0,0,0,0,78080,0,0,0,FALSE,0,29D15,,1,FALSE,FALSE,A1,,,,FALSE,FALSE,,I# 1003/678
2018,CAD,CAD,32,000002-002307,70,CAD,CH,TL,SL,ML,F1,,,,,,,FALSE,420,LHS DR,N,LUMBERTON,TX,77657,,16686,R,FRANKLIN BOBBY Q,,PO BOX 8042,,LUMBERTON,TX,77657,42,1,0,0,,,0,1977  14X56  WHITE/BEIGE,TEX0084235,P# 2-10-E-1   HCAD# 4239,,0,0,0,0,0,0,0,0,9310,9310,0,0,0,0,0,0,0,0,0,9310,0,0,0,FALSE,0,,,1,FALSE,FALSE,A2,,,,FALSE,FALSE,,
2018,CAD,CAD,35,000002-002312,70,CAD,CH,TL,SL,ML,F1,,,,,,,FALSE,104,LHS DR,N,LUMBERTON,TX,77657,,84845,R,LUXURY HOSPITALITY INC,VIJAY R VAKIL & JAYESH J PATEL,LA QUINTA INN,3995  I-10 SOUTH,BEAUMONT,TX,77705,,1,0,0,,8,2.64,AB 2 F ARRIOLA,,P# 2-10-A-1,,0,459990,0,0,0,0,0,0,2338890,2338890,0,0,0,0,0,0,0,0,0,0,0,1878900,0,FALSE,0,,,1,FALSE,FALSE,F1,,,LA QUINTA INN,FALSE,FALSE,O'CONNOR & ASSOCIATES,I# 1665/890   02/04/2008
2018,CAD,CAD,64,000002-002405,47,CAD,CH,SL,ML,F1,,,,,,,,FALSE,7720,HICKORY HOLLOW DR,,LUMBERTON,TX,77657,,96952,R,ANSELMO ALBERTO & SHANNA,,656 NECHES ST,,BEAUMONT,TX,77701,,1,0,0,,,3.869,AB 2 F ARRIOLA,,P# 2-10-N-A,,38690,0,0,0,0,0,0,0,67020,67020,0,0,0,0,0,0,0,0,0,28330,0,0,0,FALSE,0,,,1,FALSE,FALSE,A1,,,,FALSE,FALSE,,I# 2013-39438   7/19/13
2018,CAD,CAD,90,000002-002500,70,CAD,CH,TL,SL,ML,F1,,,,,,,FALSE,1190,CHANCE RD,W,LUMBERTON,TX,77657,,29161,R,LUQUETTE DAVID & MAVIS,,1190 W CHANCE RD,,LUMBERTON,TX,77657,7159,1,0,0,H,,2.21,AB 2 F ARRIOLA,,P# 2-13   TRACT 5,,33150,0,0,0,0,0,0,0,93540,93540,0,0,0,0,0,0,0,0,0,60390,0,0,0,FALSE,0,,,1,FALSE,FALSE,A1,,,,FALSE,FALSE,,I# 939/395
2018,CAD,CAD,119,000002-002560,47,CAD,CH,SL,ML,F1,,,,,,,,FALSE,4732,AMANDA LN,,LUMBERTON,TX,77657,,77704,R,MARTIN MICHAEL W & LAURA,,4732 AMANDA LN,,LUMBERTON,TX,77657,8168,1,0,0,H,,5,AB 2 F ARRIOLA,,P# 2-10-T-1,,30500,0,0,0,0,0,0,0,295420,295420,0,0,0,0,0,0,0,0,0,264920,0,0,0,FALSE,0,,,1,FALSE,FALSE,E1,,,,FALSE,FALSE,,I# 1546/37   03/02/2006
2018,CAD,CAD,123,000002-002650,70,CAD,CH,TL,SL,ML,F1,,,,,,,FALSE,1150,CHANCE RD CUTOFF,W,LUMBERTON,TX,77657,,89372,R,WATSON THOMAS G & THELMA,,1150 W CHANCE CUT OFF,,LUMBERTON,TX,77657,,1,0,0,H,,1.117,AB 2 F ARRIOLA,TRACT 10A & 12,P# 2-19-B,,22340,0,0,0,0,0,0,0,200640,200640,0,0,0,0,0,0,0,0,0,178300,0,0,0,FALSE,0,,,1,FALSE,FALSE,A1,,,,FALSE,FALSE,,I# 1798/621   12/13/2010
2018,CAD,CAD,133,000002-003350,70,CAD,CH,TL,SL,ML,F1,,,,,,,FALSE,20,DOGWOOD LN,,LUMBERTON,TX,77657,,1204,R,ADAMS ROBERT M & LENA S,,20 DOGWOOD LN,,LUMBERTON,TX,77657,7121,1,0,0,H,,1,AB 2 F ARRIOLA,,P# 2-22-A   TRACT 20A,,42000,0,0,0,0,0,0,0,110040,110040,0,0,0,0,0,0,0,0,0,68040,0,0,0,FALSE,0,,,1,FALSE,FALSE,A1,,,,FALSE,FALSE,,I# 1085/509
2018,CAD,CAD,153,000002-003950,70,CAD,CH,TL,SL,ML,F1,,,,,,,FALSE,75,BLANTON RD,S,LUMBERTON,TX,77657,,9963,R,CLARK NANCY LOU,,75 BLANTON RD,,LUMBERTON,TX,77657,7101,1,0,0,H,,1.134,AB 2 F ARRIOLA,,P# 2-32   TRACT 25,,40820,0,0,0,0,0,0,0,157160,157160,0,0,0,0,0,0,0,0,0,116340,0,0,0,FALSE,0,29D14,,1,FALSE,FALSE,A1,,,,FALSE,FALSE,,I# 931/225   10/29/91
2018,CAD,CAD,162,000002-004250,70,CAD,CH,TL,SL,ML,F1,,,,,,,FALSE,915,CHANCE RD CUTOFF,W,LUMBERTON,TX,77657,,42543,R,SPELL LYNETTE,,915  W CHANCE RD,,LUMBERTON,TX,77657,,1,0,0,H,,1,AB 2 F ARRIOLA,,P# 2-37   TRACT 61,,42000,0,0,0,0,0,0,0,69690,69690,0,0,0,0,0,0,0,0,0,27690,0,0,0,FALSE,0,,,1,FALSE,FALSE,A1,,,,FALSE,FALSE,,I# 1182/169
2018,CAD,CAD,179,000002-004750,70,CAD,CH,TL,SL,ML,F1,,,,,,,FALSE,1185,CHANCE RD CUTOFF,W,LUMBERTON,TX,77657,,106154,R,TRUONG TAM M,,1185 WEST CHANCE RD,,LUMBERTON,TX,77657,,1,0,0,H,,0.471,LOT 1 MINOR PLAT OF,FREEDOM MANOR,P# 2-45,,19780,0,0,0,0,0,0,0,144670,144670,0,0,0,0,0,0,0,0,0,124890,0,0,0,FALSE,0,29D,,1,FALSE,FALSE,A1,,,,FALSE,FALSE,,I# 201774233   05/09/2017
2018,CAD,CAD,193,000002-005350,70,CAD,CH,TL,SL,ML,F1,,,,,,,FALSE,340,LHS DR,N,LUMBERTON,TX,77657,,7107,R,BRYANT LEONARD D & LOLA,,340 N LHS DR,,LUMBERTON,TX,77657,8621,1,0,0,H,,0.62,AB 2 F ARRIOLA,,P# 2-54   TRACT 36,,27010,0,0,0,0,0,0,0,136950,136950,0,0,0,0,0,0,0,0,0,109940,0,0,0,FALSE,0,,,1,FALSE,FALSE,A1,,,,FALSE,FALSE,,
2018,CAD,CAD,225,000002-006760,70,CAD,CH,TL,SL,ML,F1,,,,,,,FALSE,510,JORDAN DR,,LUMBERTON,TX,77657,,39712,R,SAWYER GENE RAY & SYLVIA,,510 JORDAN DR,,LUMBERTON,TX,77657,7030,1,0,0,H,,1.002,AB 2 F ARRIOLA,,P# 2-74-A   TRACT 66,,36070,0,0,0,0,0,0,0,68020,68020,0,0,0,0,0,0,0,0,0,31950,0,0,0,FALSE,0,,,1,FALSE,FALSE,A1,,,,FALSE,FALSE,,I# 1199/83
2018,CAD,CAD,251,000002-007300,47,CAD,CH,SL,ML,F1,,,,,,,,FALSE,7392,HICKORY HOLLOW DR,,LUMBERTON,TX,77657,,50278,R,WOELLER LINDA KAY,,7392 HICKORY HOLLOW DR,,LUMBERTON,TX,77657,9777,1,0,0,,,1.663,AB 2 F ARRIOLA,,P# 2-83-A   TRACT 2,,12470,0,0,0,0,0,0,0,12470,12470,0,0,0,0,0,0,0,0,0,0,0,0,0,FALSE,0,,,1,FALSE,FALSE,A2,,,,FALSE,FALSE,,I# 1314/503
2018,CAD,CAD,262,000002-007505,47,CAD,CH,SL,ML,F1,,,,,,,,FALSE,5148,CLUBB RD,,LUMBERTON,TX,77657,,106909,R,SIMMONS COREY M & SARAH E,,5148 CLUBB RD,,LUMBERTON,TX,77657,,1,0,0,H,,0.856,AB 2 F ARRIOLA,,P# 2-84-A-2,,4820,0,0,0,0,0,0,0,196520,196520,0,0,0,0,0,0,0,0,0,191700,0,0,0,FALSE,0,,,1,FALSE,FALSE,A1,,,,FALSE,FALSE,,I# 1179/795   01/05/2010
2018,CAD,CAD,264,000002-007550,47,CAD,CH,SL,ML,F1,,,,,,,,FALSE,5276,CLUBB RD,,LUMBERTON,TX,77657,,69177,R,CLUBB WILLIAM B JR & JOANN,REVOCABLE LIVING TRUST,5302 CLUBB RD,,LUMBERTON,TX,77657,9742,1,0,0,,,21.484,AB 2 F ARRIOLA,,P# 2-84-B   TRACT 82 & 84,,0,0,42970,0,0,5290,0,0,42970,5290,0,0,0,0,0,0,0,0,0,0,0,0,0,FALSE,0,40B,,1,FALSE,FALSE,D1,,,,FALSE,FALSE,,I# 1499/579
2018,CAD,CAD,275,000002-007950,47,CAD,CH,SL,ML,F1,,,,,,,,FALSE,,SPILLERS RD,,LUMBERTON,TX,77657,,108679,R,"BINV INC, A TEXAS CORPORATION",DBA TODAYS FINANCIAL,PO BOX 8579,,LUMBERTON,TX,77657,,0.5,0,0,,,0.758,AB 2 F ARRIOLA,,P# 2-88-E        TRACT 3,,5680,0,0,0,0,0,0,0,5680,5680,0,0,0,0,0,0,0,0,0,0,0,0,0,FALSE,0,,,1,FALSE,FALSE,C1,,,,FALSE,FALSE,,I# 2018-84038   04/10/2018
2018,CAD,CAD,280,000002-008101,47,CAD,CH,SL,ML,F1,,,,,,,,FALSE,4601,SPILLERS RD,,LUMBERTON,TX,77657,,8146,R,CAMPBELL RICKY W & MELANIE,,4601 SPILLERS RD,,LUMBERTON,TX,77657,6783,1,0,0,,,8,AB 2 F ARRIOLA,PT OF TRACT 85,P# 2-89-A,,0,4000,31000,900,0,0,0,0,35000,4900,0,0,0,0,0,0,0,0,0,0,0,0,0,FALSE,0,,,1,FALSE,FALSE,D1,E,,,FALSE,FALSE,,I# 1167/614
2018,CAD,CAD,309,000002-008395,47,CAD,CH,SL,ML,F1,,,,,,,,FALSE,,SPILLERS RD,,LUMBERTON,TX,77657,,67215,R,MASON DARREN,,4784 SPILLER RD,,LUMBERTON,TX,77657,5700,1,0,0,,,1,LOT 10 AB 2 F ARRIOLA,,P# 2-94-J,,0,0,7500,0,0,160,0,0,7500,160,0,0,0,0,0,0,0,0,0,0,0,0,0,FALSE,0,,,1,FALSE,FALSE,D1,,,,FALSE,FALSE,,I# 1730/237   5/18/09
2018,CAD,CAD,322,000002-008703,47,CAD,CH,SL,ML,F1,,,,,,,,FALSE,7292,HICKORY HOLLOW DR,,LUMBERTON,TX,77657,,44146,R,TATE JEFFERY D & RUTH BROWN,,7292 HICKORY HOLLOW DR,,LUMBERTON,TX,77657,9775,1,0,0,,,0,1998  16X76  WHITE/BURGANDY  TRA0403442,LAND PID# 320,P# 2-106   HCAD# 14798,,0,0,0,0,0,0,0,0,35760,35760,0,0,0,0,0,0,0,0,0,35760,0,0,0,FALSE,0,,,1,FALSE,FALSE,M1,,,,FALSE,FALSE,,
2018,CAD,CAD,336,000002-008910,47,CAD,CH,SL,ML,F1,,,,,,,,FALSE,,JOHNSON LN,,LUMBERTON,TX,77657,,5562,R,BOYKIN JOEL ALLEN,,4285 AUTHOR LN,,BEAUMONT,TX,77706,,1,0,0,,,1,LOT 334 AB 2 F ARRIOLA,,P# 2-109-A,,24000,0,0,0,0,0,0,0,24000,24000,0,0,0,0,0,0,0,0,0,0,0,0,0,FALSE,0,,,1,FALSE,FALSE,C1,,,,FALSE,FALSE,,
2018,CAD,CAD,356,000002-009353,47,CAD,CH,SL,ML,F1,,,,,,,,FALSE,4779,ARIOLA LN,,LUMBERTON,TX,77657,,100684,R,RICKS BRANDON & ALESIA,,4779 ARIOLA LN,,LUMBERTON,TX,77657,9714,1,0,0,H,,0.92,LOT 209 ARRIOLA ACRES,AB 2 F ARRIOLA,P# 2-110-BB-4,,13250,0,0,0,0,0,0,0,103650,103650,0,0,0,0,0,0,0,0,0,90400,0,0,0,FALSE,0,,,1,FALSE,FALSE,A1,,,,FALSE,FALSE,,I# 2015-53918   03/18/2015
2018,CAD,CAD,383,000002-009384,47,CAD,CH,SL,ML,F1,,,,,,,,FALSE,3999,SHEFFIELD LN,,LUMBERTON,TX,77657,,24890,R,JOHNSTON DARYL WAYNE,,11985 FM 92,,SILSBEE,TX,77656,9160,1,0,0,,,1.007,W/2 OF 205 ARRIOLA ACRES,1972  14X66  BLUE,P# 2-110-BB-353         HCAD# 7840,,19330,0,0,0,0,0,0,0,24320,24320,0,0,0,0,0,0,0,0,0,4990,0,0,0,FALSE,0,,,1,FALSE,FALSE,A2,,,,FALSE,FALSE,,I# 1304/755
2018,CAD,CAD,406,000002-009413,47,CAD,CH,SL,ML,F1,,,,,,,,FALSE,1707,SPELL LN,,LUMBERTON,TX,77657,,107640,R,CHERRY JUDY,,1707 SPELL LN,,LUMERTON,TX,77657,,1,0,0,H,,0,1995  16X76 BEIGE TRA0269036,LAND PID# 365,P# 2-110-BB-162   HCAD# 5265,,0,0,0,0,0,0,0,0,6290,6290,0,0,0,0,0,0,0,0,0,6290,0,0,0,FALSE,0,,,1,FALSE,FALSE,M1,,,,FALSE,FALSE,,I# SOL   09/22/2017
2018,CAD,CAD,440,000002-009901,47,CAD,CH,SL,ML,F1,,,,,,,,FALSE,5081,ARIOLA LN,,LUMBERTON,TX,77657,,30380,R,MCCAIN THELMA ROBERTA,,5081 ARIOLA LN,,LUMBERTON,TX,77657,9720,1,0,0,,,0,BUILDING ONLY,OFFICE,P# 2-110-GG,,0,0,0,0,0,0,0,0,11380,11380,0,0,0,0,0,0,0,0,0,11380,0,0,0,FALSE,0,,,1,FALSE,FALSE,A4,,,,FALSE,FALSE,,
2018,CAD,CAD,456,000002-010505,47,CAD,CH,SL,ML,F1,,,,,,,,FALSE,7036,JOHNSON LN,,LUMBERTON,TX,77657,,4539,R,BISHOP PARKER & DOROTHY-LIFE ESTATE,,7036 JOHNSON LN,,LUMBERTON,TX,77657,7505,1,0,0,,,3.7,PT OF LOT 320 ARRIOLA ACRES,AB 2 F ARRIOLA,P# 2-110-M-2,,13320,0,0,0,0,0,0,0,13320,13320,0,0,0,0,0,0,0,0,0,0,0,0,0,FALSE,0,,,1,FALSE,FALSE,E,,,,FALSE,FALSE,,
2018,CAD,CAD,466,000002-010650,47,CAD,CH,SL,ML,F1,,,,,,,,FALSE,,GRACE LN,,LUMBERTON,TX,77657,,41366,R,SKELTON WILFORD C,,341 N VILLAGE CREEK PKWY,,LUMBERTON,TX,77657,7741,1,0,0,,,9.9,LOT 207 ARRIOLA ACRES,AB 2 F ARRIOLA,P# 2-110-NN   TRACT 40,,0,118800,0,0,0,0,0,0,118800,118800,0,0,0,0,0,0,0,0,0,0,0,0,0,FALSE,0,,,1,FALSE,FALSE,E,,,,FALSE,FALSE,,
2018,CAD,CAD,480,000002-010960,47,CAD,CH,SL,ML,F1,,,,,,,,FALSE,4357,WILSON LN,,LUMBERTON,TX,77657,,38909,R,ROMERO PEGGY,,PO BOX 8958,,LUMBERTON,TX,77657,958,1,0,0,H,,2.25,LOTS 217 & 218 ARRIOLA ACRES,AB 2 F ARRIOLA,P# 2-110-TT,,34200,0,0,0,0,0,0,0,113010,113010,0,0,0,0,0,0,0,0,0,78810,0,0,0,FALSE,0,,,1,FALSE,FALSE,A1,,,,FALSE,FALSE,,
2018,CAD,CAD,491,000002-011150,47,CAD,CH,SL,ML,F1,,,,,,,,FALSE,5373,ARIOLA LN,,LUMBERTON,TX,77657,,43302,R,STOUDEMAYER LINDA,,PO BOX 8047,,LUMBERTON,TX,77657,47,1,0,0,H,,0.92,LOTS 18 & 19 ARRIOLA ACRES,AB 2 F ARRIOLA,P# 2-110-X   TRACT 2A,,17480,0,0,0,0,0,0,0,96350,96350,0,0,0,0,0,0,0,0,0,78870,0,0,0,FALSE,0,,,1,FALSE,FALSE,A1,,,,FALSE,FALSE,,
2018,CAD,CAD,507,000002-011370,47,CAD,CH,SL,ML,F1,,,,,,,,FALSE,6776,JOHNSON LN,,LUMBERTON,TX,77657,,82033,R,NOLTE RUSSELL & MARINA,,6776 JOHNSON LN,,LUMBERTON,TX,77657,6730,1,0,0,,,2,LOT 314 ARRIOLA ACRES,AB 2 F ARRIOLA,P# 2-110-EEE,,38000,0,0,0,0,0,0,0,188640,188640,0,0,0,0,0,0,0,0,0,150640,0,0,0,FALSE,0,,,1,FALSE,FALSE,A1,,,,FALSE,FALSE,,I# 1625/820   6/14/07
2018,CAD,CAD,516,000002-011385,47,CAD,CH,SL,ML,F1,,,,,,,,FALSE,6382,JOHNSON LN,,LUMBERTON,TX,77657,,35471,R,PELT BUDDY,,6382 JOHNSON LN,,LUMBERTON,TX,77657,6722,1,0,0,H,,5,LOT 308 ARRIOLA ACRES,AB 2 F ARRIOLA,P# 2-110-HHH,,60000,0,0,0,0,0,0,0,91020,85880,0,0,0,0,0,0,0,0,0,31020,0,0,0,FALSE,0,,,1,FALSE,FALSE,A1,,,,FALSE,FALSE,,
2018,CAD,CAD,532,000002-011415,47,CAD,CH,SL,ML,F1,,,,,,,,FALSE,6382,JOHNSON LN,,LUMBERTON,TX,77657,,35476,R,PELT DAWN N,,6382 JOHNSON LN,,LUMBERTON,TX,77657,6722,1,0,0,,,0,1999  14X76  GRAY/WHITE,RAD1083524,P# 2-110-HHH       HCAD# 7326,,0,0,0,0,0,0,0,0,25300,25300,0,0,0,0,0,0,0,0,0,25300,0,0,0,FALSE,0,,,1,FALSE,FALSE,M1,,,,FALSE,FALSE,,LAND PID #00516
2018,CAD,CAD,556,000002-011600,47,CAD,CH,SL,ML,F1,,,,,,,,FALSE,4100,SHEFFIELD LN,,LUMBERTON,TX,77657,,34960,R,PARFAIT HAL,RITA DYSON,2795 S 8TH ST APT# 301,,BEAUMONT,TX,77701,,1,0,0,,,2.58,LOT 204-C ARRIOLA ACRES,1984  14X80  GRAY  TEX0320193,P# 2-130   HCAD# 7674,,49020,0,0,0,0,0,0,0,51880,51880,0,0,0,0,0,0,0,0,0,2860,0,0,0,FALSE,0,,,1,FALSE,FALSE,A2,,,,FALSE,FALSE,,
2018,CAD,CAD,575,000002-012006,47,CAD,CH,SL,ML,F1,,,,,,,,FALSE,3896,SHEFFIELD LN #6,,LUMBERTON,TX,77657,,94587,R,MILLER AL & COLLEEN,,PO BOX 8624,,LUMBERTON,TX,77657,,1,0,0,H,,0,2001  16X76  WHITE/GREEN,HWC0315555,P# 2-110-FFF   HCAD# 12396,,0,0,0,0,0,0,0,0,23320,23320,0,0,0,0,0,0,0,0,0,23320,0,0,0,FALSE,0,,,1,FALSE,FALSE,M1,,,,FALSE,FALSE,,
2018,CAD,CAD,588,000002-012503,70,CAD,CH,TL,SL,ML,F1,,,,,,,FALSE,6654,CARNATION DR,,LUMBERTON,TX,77657,,96210,R,BAYLESS CARL & ANDREA,,11063 PECK RD,,LUMBERTON,TX,77657,7824,1,0,0,,,0,2002  16X76  WHITE/GREEN  HWC0320377,LAND PID# 00094,P# 2-10-S   HCAD# 13729,,0,0,0,0,0,0,0,0,28250,28250,0,0,0,0,0,0,0,0,0,28250,0,0,0,FALSE,0,,,1,FALSE,FALSE,M1,,,,FALSE,FALSE,,
2018,CAD,CAD,596,000002-012511,70,CAD,CH,TL,SL,ML,F1,,,,,,,FALSE,5533,SUMMERVILLE DR,,LUMBERTON,TX,77657,,106386,R,P & D HOUSING LLC,,PO BOX 3007,,THOUSAND OAKS,CA,91359,,1,0,0,,,0,1994  16X76  WHITE/GRAY WOODGRAIN  LOU0047114,LAND PID# 00094,P# 2-10-S   HCAD# 14605,,0,0,0,0,0,0,0,0,13700,13700,0,0,0,0,0,0,0,0,0,13700,0,0,0,FALSE,0,,,1,FALSE,FALSE,M1,,,,FALSE,FALSE,,I# SOL   06/22/2017
2018,CAD,CAD,598,000002-012513,70,CAD,CH,TL,SL,ML,F1,,,,,,,FALSE,5541,SUMMERVILLE DR,,LUMBERTON,TX,77657,,78030,R,SHELBURNE J E,,8289 CROSS WIND,,LUMBERTON,TX,77657,8504,1,0,0,,,0,1999  16X72  WHITE/NAVY  NTA0927673,LOT 11 BLK 1 SUMMERVILLE MHP   LAND PID# 00094,P# 2-10-S   HCAD# 14603,,0,0,0,0,0,0,0,0,26490,26490,0,0,0,0,0,0,0,0,0,26140,350,0,0,FALSE,0,,,1,FALSE,FALSE,M1,,,,FALSE,FALSE,,
2018,CAD,CAD,612,000002-012527,70,CAD,CH,TL,SL,ML,F1,,,,,,,FALSE,6640,DAISY LN,,LUMBERTON,TX,77657,,68471,R,SEAMANS RALPH W JR,,6640 DAISY,,LUMBERTON,TX,77657,6824,1,0,0,H,,0,1999  28X56  TAN/BLACK,RAD1150916/7  LAND PID# 00094,P# 2-10-S   HCAD# 13706,,0,0,0,0,0,0,0,0,39340,39340,0,0,0,0,0,0,0,0,0,39340,0,0,0,FALSE,0,,,1,FALSE,FALSE,M1,,,,FALSE,FALSE,,BLK 11 LOT 4
2018,CAD,CAD,629,000003-000351,53,CAD,CH,SS,F2,,,,,,,,,FALSE,8725,BUSSEY RD,,SILSBEE,TX,77656,,85379,R,CRAVY DAVID DAWSON &,CRAVY DAPHNE FIFINE,8725 BUSSEY RD,,SILSBEE,TX,77656,,1,0,0,,,2.77,AB 3 S P BANKSTON,,P# 3-4,,13850,0,0,0,0,0,0,0,43540,43540,0,0,0,0,0,0,0,0,0,29690,0,0,0,FALSE,0,,,1,FALSE,FALSE,A1,,,,FALSE,FALSE,,I# 1713/799
2018,CAD,CAD,637,000003-000359,53,CAD,CH,SS,F2,,,,,,,,,FALSE,,BUSSEY RD,,SILSBEE,TX,77656,,85379,R,CRAVY DAVID DAWSON &,CRAVY DAPHNE FIFINE,8725 BUSSEY RD,,SILSBEE,TX,77656,,1,0,0,,,0,HOUSE ONLY,,P# 3-4,,0,0,0,0,0,0,0,0,32400,32400,0,0,0,0,0,0,0,0,0,32400,0,0,0,FALSE,0,,,1,FALSE,FALSE,A4,,,,FALSE,FALSE,,I# 1713/799
2018,CAD,CAD,680,000003-001420,53,CAD,CH,SS,F2,,,,,,,,,FALSE,8483,BUSSEY RD,,SILSBEE,TX,77656,,72201,R,CARTER JOSEPH & DIANA,,PO BOX 1902,,SILSBEE,TX,77656,1902,1,0,0,,,0.77,AB 3 S P BANKSTON,,P# 3-5-D,,7700,0,0,0,0,0,0,0,9200,9200,0,0,0,0,0,0,0,0,0,1500,0,0,0,FALSE,0,,,1,FALSE,FALSE,A5,,,,FALSE,FALSE,,I# 1375/329   06/18/2003
2018,CAD,CAD,693,000003-001660,53,CAD,CH,SS,F2,,,,,,,,,FALSE,2920,FM 92,N,SILSBEE,TX,77656,,96986,R,PEREZ NARCISO,,2920 FM 92 N,,SILSBEE,TX,77656,,1,0,0,H,,0.17,AB 3 S P BANKSTON,,P# 3-24-1,,1700,0,0,0,0,0,0,0,49040,49040,0,0,0,0,0,0,0,0,0,47340,0,0,0,FALSE,0,,,1,FALSE,FALSE,A1,,,,FALSE,FALSE,,I# 2014-47257   06/02/2014
2018,CAD,CAD,757,000003-003600,53,CAD,CH,SS,F2,,,,,,,,,FALSE,,WILLIS RD,,SILSBEE,TX,77656,,93728,R,MARTINEZ ALMA F,,8683 WILLIS RD,,SILSBEE,TX,77656,,1,0,0,,,1.593,AB 3 S P BANKSTON,,P# 3-58,,15930,0,0,0,0,0,0,0,15930,15930,0,0,0,0,0,0,0,0,0,0,0,0,0,FALSE,0,,,1,FALSE,FALSE,C1,,,,FALSE,FALSE,,I# 2012-27453   04/05/2012
2018,CAD,CAD,817,000003-005600,53,CAD,CH,SS,F2,,,,,,,,,FALSE,2000,FM 92,N,SILSBEE,TX,77656,,94866,R,LEMUS AGRIPINA DUARTE,,3641 D OLD EVADALE ROAD,,SILSBEE,TX,77656,,1,0,0,,,0.35,AB 3 S P BANKSTON,,P# 3-86,,3500,0,0,0,0,0,0,0,65730,65730,0,0,0,0,0,0,0,0,0,62230,0,0,0,FALSE,0,,,1,FALSE,FALSE,A1,,,,FALSE,FALSE,,I# 1440/413 & 859/742
2018,CAD,CAD,823,000003-006000,53,CAD,CH,SS,F2,,,,,,,,,FALSE,8498,WILLIS RD,,SILSBEE,TX,77656,,101411,R,HICKMAN MILAN T & KAY,,PO BOX 1565,,SILSBEE,TX,77656,,1,0,0,,,10,AB 3 S P BANKSTON,,P# 3-92   TRACT 77,,36000,0,0,0,0,0,0,0,36000,36000,0,0,0,0,0,0,0,0,0,0,0,0,0,FALSE,0,,,1,FALSE,FALSE,E,,,,FALSE,FALSE,,I# 2015-56973   07/13/2015
2018,CAD,CAD,824,000003-006050,53,CAD,CH,SS,F2,,,,,,,,,FALSE,8500,WILLIS RD,,SILSBEE,TX,77656,,48019,R,WATTS JAMES LEE,,PO BOX 1297,,SILSBEE,TX,77656,1297,1,0,0,H,,2.96,AB 3 S P BANKSTON,,P# 3-93,,29600,0,0,0,0,0,0,0,61790,61790,0,0,0,0,0,0,0,0,0,32190,0,0,0,FALSE,0,,,1,FALSE,FALSE,A1,,,,FALSE,FALSE,,I# 831/491
2018,CAD,CAD,826,000003-006150,53,CAD,CH,SS,F2,,,,,,,,,FALSE,8516,CURRY LN,,SILSBEE,TX,77656,,80114,R,MOSS CHERYL,,8516 CURRY LN,,SILSBEE,TX,77656,9648,1,0,0,,,1,AB 3 S P BANKSTON,,P# 3-93-B,,10000,0,0,0,0,0,0,0,10000,10000,0,0,0,0,0,0,0,0,0,0,0,0,0,FALSE,0,,,1,FALSE,FALSE,A2,,,,FALSE,FALSE,,I# 1048/879
2018,CAD,CAD,831,000003-006300,53,CAD,CH,SS,F2,,,,,,,,,FALSE,8585,CURRY LN,,SILSBEE,TX,77656,,20899,R,HARRISON RAY LEWIS JR,,420 W 6TH ST,,CRAWFORD,TX,76638,,1,0,0,,,1,AB 3 S P BANKSTON,,P# 3-96,,10000,0,0,0,0,0,0,0,46290,46290,0,0,0,0,0,0,0,0,0,36290,0,0,0,FALSE,0,,,1,FALSE,FALSE,A1,,,,FALSE,FALSE,,I# 715/219
2018,CAD,CAD,837,000003-006450,53,CAD,CH,SS,F2,,,,,,,,,FALSE,8826,WILLIS RD,,SILSBEE,TX,77656,,78254,R,SCOTT BRADLEY D & SHARON H,,8826 WILLIS RD,,SILSBEE,TX,77656,9642,1,0,0,H,,0.942,AB 3 S P BANKSTON,,P# 3-99,,9420,0,0,0,0,0,0,0,62570,58700,0,0,0,0,0,0,0,0,0,53150,0,0,0,FALSE,0,,,1,FALSE,FALSE,A1,,,,FALSE,FALSE,,I# 1545/277
2018,CAD,CAD,851,000003-007050,53,CAD,CH,SS,F2,,,,,,,,,FALSE,1752,WILLIAMS LN,S,SILSBEE,TX,77656,,88988,R,BRAWLEY FRANCES JEAN MOORE,,1820 S WILLIAMS LN,,SILSBEE,TX,77656,8335,1,0,0,,,2.66,AB 3 S P BANKSTON,,P# 3-110,,26600,0,0,0,0,0,0,0,47780,47780,0,0,0,0,0,0,0,0,0,20760,0,420,0,FALSE,0,,,1,FALSE,FALSE,A1,,,,FALSE,FALSE,,I# 1759/674 & WILL
2018,CAD,CAD,874,000003-007551,53,CAD,CH,SS,F2,,,,,,,,,FALSE,,WINTERGREEN LN,,SILSBEE,TX,77656,,89129,R,LEWIS KATHRYN CARAWAY,,1741 WINTERGREEN LN,,SILSBEE,TX,77656,,1,0,0,,,0,1999  16X76  BEIGE/GREEN  RAD0115258,LAND ACCT# 873,P# 3-122   HCAD# 8379,,0,0,0,0,0,0,0,0,28140,28140,0,0,0,0,0,0,0,0,0,0,0,28140,0,FALSE,0,,,1,FALSE,FALSE,A2,,,,FALSE,FALSE,,I# WILL
2018,CAD,CAD,896,000003-008451,53,CAD,CH,SS,F2,,,,,,,,,FALSE,10309,BUSSEY RD,,SILSBEE,TX,77656,,97690,R,MENOWN HUGH A & GINGER,,99 N POST OAK LN #3207,,HOUSTON,TX,77024,,1,0,0,,,16.23,AB 3 S P BANKSTON,,P# 3-139-A,,5000,0,76150,2290,0,0,0,0,296960,223100,0,0,0,0,0,0,0,0,0,215810,0,0,0,FALSE,0,,,1,FALSE,FALSE,D1,E1,,,FALSE,FALSE,,I# 2014-43663   1/7/14
2018,CAD,CAD,898,000003-008600,53,CAD,CH,SS,F2,,,,,,,,,FALSE,10356,BUSSEY RD,,SILSBEE,TX,77656,,25318,R,JORDAN GLENDA EARLE,,10356 BUSSEY RD,,SILSBEE,TX,77656,8196,1,0,0,H,,1.57,AB 3 S P BANKSTON,1990  16X56  GRAY,P# 3-140   HCAD# 7023,,15700,0,0,0,0,0,0,0,29770,29770,0,0,0,0,0,0,0,0,0,14070,0,0,0,FALSE,0,,,1,FALSE,FALSE,A2,,,,FALSE,FALSE,,
2018,CAD,CAD,899,000003-008605,53,CAD,CH,SS,F2,,,,,,,,,FALSE,9251,BRITTONVILLE RD,,SILSBEE,TX,77656,,108554,R,LEE SAMANTHA,,2528 67TH ST,,PORT ARTHUR,TX,77640,,1,0,0,,,0.78,AB 3 S P BANKSTON,,P# 3-140   TRACT 3,,7800,0,0,0,0,0,0,0,56170,56170,0,0,0,0,0,0,0,0,0,48370,0,0,0,FALSE,0,,,1,FALSE,FALSE,A1,,,,FALSE,FALSE,,I# 2018-84475   04/25/2018
2018,CAD,CAD,938,000003-009765,53,CAD,CH,SS,F2,,,,,,,,,FALSE,,WHITEHEAD RD,,SILSBEE,TX,77656,,95693,R,RASHALL JERALD D,,2101 WHITEHEAD DR,,SILSBEE,TX,77656,,0.5,0,0,,,0.6,AB 3 S P BANKSTON,,P# 3-155-A-6,,4500,0,0,0,0,0,0,0,4500,4500,0,0,0,0,0,0,0,0,0,0,0,0,0,FALSE,0,,,2,FALSE,FALSE,C1,,,,FALSE,FALSE,,
2018,CAD,CAD,956,000003-010050,53,CAD,CH,SS,F2,,,,,,,,,FALSE,,KELLY,,SILSBEE,TX,77656,,48941,R,HALTMEYER PAMELA,,1709 WHITEHALL LANE,,GARLAND,TX,75043,1137,1,0,0,,,2,AB 3 S P BANKSTON,,P# 3-156   TRACT 138,,20000,0,0,0,0,0,0,0,31240,31240,0,0,0,0,0,0,0,0,0,11240,0,0,0,FALSE,0,,,1,FALSE,FALSE,E1,,,,FALSE,FALSE,,PROBATE# PR-16-03198-3
2018,CAD,CAD,961,000003-010350,53,CAD,CH,SS,F2,,,,,,,,,FALSE,7538,MARICLE LN,,SILSBEE,TX,77656,,29652,R,MARICLE DWAYNE,,7538 MARICLE LN,,SILSBEE,TX,77656,7376,1,0,0,H,,3,AB 3 S P BANKSTON,,P# 3-161,,18000,0,0,0,0,0,0,0,68430,68430,0,0,0,0,0,0,0,0,0,50430,0,0,0,FALSE,0,,,1,FALSE,FALSE,A1,,,,FALSE,FALSE,,I# 1044/165 & 1151/739
2018,CAD,CAD,967,000003-010450,53,CAD,CH,SS,F2,,,,,,,,,FALSE,7510,MARICLE LN,,SILSBEE,TX,77656,,24425,R,JENKINS J & J STUTZENBURG,,7510 MARICLE LN,,SILSBEE,TX,77656,7376,1,0,0,H,,1.17,AB 3 S P BANKSTON,,P# 3-162-A,,11700,0,0,0,0,0,0,0,77380,77380,0,0,0,0,0,0,0,0,0,65680,0,0,0,FALSE,0,,,1,FALSE,FALSE,A1,,,,FALSE,FALSE,,I# 1056/254
2018,CAD,CAD,969,000003-010550,53,CAD,CH,SS,F2,,,,,,,,,FALSE,2016,WILLIAMS LN,N,SILSBEE,TX,77656,,68076,R,JURECEK JOHN R,,2016 N WILLIAMS LN,,SILSBEE,TX,77656,7762,1,0,0,,,0.32,AB 3 S P BANKSTON,TR 100X100,P# 3-166,,3200,0,0,0,0,0,0,0,24680,24680,0,0,0,0,0,0,0,0,0,21480,0,0,0,FALSE,0,,,1,FALSE,FALSE,A1,,,,FALSE,FALSE,,I# 1490/208   03/17/2005
2018,CAD,CAD,1012,000003-012529,53,CAD,CH,SS,F2,,,,,,,,,FALSE,,MONKEY,,SILSBEE,TX,77656,,29450,R,MALCOLM BARBARA A,,12761 N DOWLING RD,,COLLEGE STATION,TX,77845,8571,1,0,0,,,0.5,AB 3 S P BANKSTON,,P# 3-193-G-3,,5000,0,0,0,0,0,0,0,5000,5000,0,0,0,0,0,0,0,0,0,0,0,0,0,FALSE,0,,,1,FALSE,FALSE,C1,,,,FALSE,FALSE,,I# 845/239
2018,CAD,CAD,1013,000003-012531,53,CAD,CH,SS,F2,,,,,,,,,FALSE,,,,SILSBEE,TX,77656,,85320,R,MANGINELLO RALPH P JR,,1635 DUNLAVY ST,,HOUSTON,TX,77006,,1,0,0,,,1,AB 3 S P BANKSTON,,P# 3-193-G-5   TRACT 2-3,,10000,0,0,0,0,0,0,0,10000,10000,0,0,0,0,0,0,0,0,0,0,0,0,0,FALSE,0,,,1,FALSE,FALSE,C1,,,,FALSE,FALSE,,I# 1719/555
2018,CAD,CAD,1026,000003-012850,53,CAD,CH,SS,F2,,,,,,,,,FALSE,2467,BUCHANNON RD,,SILSBEE,TX,77656,,104269,R,PETERSON DEBORAH & SCOTT,,2467 BUCHANAN RD,,SILSBEE,TX,77656,,1,0,0,H,,0.5,AB 3 S P BANKSTON,PINEVIEW TERRACE,P# 3-193-G-17   TRACT 23,,5000,0,0,0,0,0,0,0,113230,113230,0,0,0,0,0,0,0,0,0,108230,0,0,0,FALSE,0,,,1,FALSE,FALSE,A1,,,,FALSE,FALSE,,I# 2016-69003   10/20/2016
2018,CAD,CAD,1028,000003-012950,53,CAD,CH,SS,F2,,,,,,,,,FALSE,2374,BUCHANNON RD,,SILSBEE,TX,77656,,101412,R,AGNEW JACOB D,,2374  BUCHANAN RD,,SILSBEE,TX,77656,,1,0,0,H,,0.72,AB 3 S P BANKSTON,PINEVIEW TERRACE,P# 9-193-G-19      TRACT 18,,7200,0,0,0,0,0,0,0,108330,108330,0,0,0,0,0,0,0,0,0,101130,0,0,0,FALSE,0,,,1,FALSE,FALSE,A1,,,,FALSE,FALSE,,I# 2015-56778   07/07/2015
2018,CAD,CAD,1049,000003-013800,53,CAD,CH,SS,F2,,,,,,,,,FALSE,7133,DUPLISSEY LN,,SILSBEE,TX,77656,,38330,R,RIVERS ANDREW ESTATE,PATRICIA GAIL YOUNG,4215 BLUE GRASS COURT,,FLOWER MOUND,TX,75028,,1,0,0,,,7.91,AB 3 S P BANKSTON,,P# 3-193-L-6,,47460,0,0,0,0,0,0,0,187970,187970,0,0,0,0,0,0,0,0,0,140510,0,0,0,FALSE,0,,,1,FALSE,FALSE,E1,,,,FALSE,FALSE,,I# 2014-47049   05/23/2014
2018,CAD,CAD,1061,000003-014050,53,CAD,CH,SS,F2,,,,,,,,,FALSE,8725,SKINNER LN,,SILSBEE,TX,77656,,41391,R,SKINNER JEFF HATTON,,8725 SKINNER LN,,SILSBEE,TX,77656,7408,1,0,0,H,,5,AB 3 S P BANKSTON,,P# 3-196,,19200,6000,0,0,0,0,0,0,149210,107710,0,0,0,0,0,0,0,0,0,124010,0,0,0,FALSE,0,,,1,FALSE,FALSE,F1,A1,,,FALSE,FALSE,,I# 1101/236   PROBATE 10095